program: Gaussian 09
title: 000264578
version: EM64L-G09RevD.01
frameworkgroup: C1[X(C14H11Cl3N2O4S)]
method: RPBEPBE
basis: SDD
operation: Freq
keyword: #p
keyword: freq=noraman
keyword: PBEPBE/SDD
title: #p freq=noraman PBEPBE/SDD
converged: YES YES NO NO
title: Mulliken charges:
elementType: Cl Cl Cl S O O O O N N C C C C C C C C C C C C C C H H H H H H H H H H H
charge: 0.033017 0.025706 0.024956 0.962015 -0.505461 -0.507665 -0.315773 -0.427417 -0.461366 0.008085 0.049466 -0.145561 -0.194431 0.507665 -0.079402 -0.171242 -0.081463 -0.465269 -0.429261 0.214036 0.176077 -0.361948 -0.314617 -0.523179 0.327612 0.293249 0.291525 0.290036 0.226739 0.219671 0.242992 0.381822 0.230233 0.230828 0.248325
chargesum: 0.00000
title: Mulliken charges with hydrogens summed into heavy atoms:
elementType: Cl Cl Cl S O O O O N N C C C C C C C C C C C C C C
charge: 0.033017 0.025706 0.024956 0.962015 -0.505461 -0.507665 -0.315773 -0.045595 -0.168117 0.008085 0.049466 -0.145561 0.133181 0.507665 -0.079402 0.120283 -0.081463 -0.175233 -0.202522 0.214036 0.176077 -0.142276 -0.071625 0.186207
polarizability: 3.95778282e+02 2.89339045e+01 2.93801842e+02 -8.40408456e+00 1.82160333e+01 1.70581413e+02
1716.lowfreq: -0.0021 -0.0020 0.0011 0.2105 1.9065 4.0859 7.8687 16.7833 19.2841
frequency: 7.7347 16.7126 19.2811 41.0072 45.5542 60.9403 86.9247 108.1203 116.0857 122.2191 139.0617 161.1979 176.1085 178.0472 182.0162 194.9586 201.8399 206.9023 222.7104 230.7141 242.9262 264.9062 294.9490 314.0810 315.6105 329.4269 367.2824 388.7002 397.9454 425.6116 451.3051 454.9064 465.7149 475.2052 488.8697 496.9293 515.0745 550.7717 573.8389 604.0308 609.6437 618.0147 659.9719 698.3359 724.5670 733.8352 744.0575 788.7601 792.3057 798.6306 817.2179 866.8344 896.2901 911.9021 918.7243 932.4159 949.2672 967.3272 991.5826 995.6440 1014.3597 1092.4394 1116.5087 1124.1848 1131.0062 1150.2801 1163.0215 1196.4791 1227.6197 1236.3153 1266.3590 1268.4403 1293.9908 1305.8076 1371.5600 1378.2274 1407.6847 1417.1060 1437.3857 1466.4590 1470.6982 1481.3688 1495.9462 1549.8863 1554.8148 1568.2143 1586.9446 1628.4821 2972.0794 2993.3342 3065.0583 3132.9718 3134.6202 3148.3837 3164.5691 3180.1418 3182.2573 3185.6935 3516.6766
redmass: 11.1885 8.5962 6.6264 7.7285 9.0368 9.3406 5.4703 6.6681 7.9380 12.1920 11.4716 6.0802 11.8573 20.0675 3.2828 4.9405 3.1479 6.5492 5.5233 1.5670 8.3033 9.1190 5.4147 20.8796 10.8112 5.7075 12.1850 7.3445 4.9743 6.2469 3.0934 4.8660 6.1719 5.7573 6.3124 1.1038 6.3877 4.0686 9.3242 10.1388 6.2284 3.9976 7.5542 3.5324 3.7898 5.1007 2.7735 3.9398 1.6749 2.8356 11.0852 1.4871 1.4093 1.4318 1.3813 1.6278 12.1959 2.9818 7.8925 8.2699 4.0666 1.7645 1.2552 2.2212 5.7383 1.4439 1.5666 1.5699 1.1876 1.7029 1.9881 1.5230 1.3936 8.9478 10.3749 2.4083 3.3854 2.7433 1.2159 1.0497 1.3338 2.2393 2.9898 9.5189 6.6601 8.4775 6.6196 6.5882 1.0322 1.0876 1.1047 1.0941 1.0951 1.0920 1.0949 1.0932 1.0924 1.0740 1.0646
irintensity: 0.3272 0.7802 2.1586 0.4424 0.1032 0.6557 1.9208 3.1480 2.6148 1.1334 18.0195 7.5659 1.9014 0.0957 2.3476 2.4608 29.4325 11.1716 5.5805 5.5826 0.8479 4.1980 15.0410 9.6506 24.5958 5.5420 125.2718 33.0530 0.5786 16.2753 4.8597 11.9911 73.1852 26.0268 7.2820 143.9081 37.7933 12.4461 14.9370 0.4522 24.6731 2.7929 13.8854 0.5560 2.7284 36.7450 86.4574 42.1200 52.9729 186.8861 124.3261 15.4446 0.7876 22.6652 16.2226 22.8500 34.7072 35.8493 60.9891 81.1942 6.5020 45.2804 0.1409 138.8806 60.2381 0.8908 77.3273 71.9446 12.4354 55.7105 199.5109 115.3812 35.7656 33.8680 3.1365 52.7504 14.8352 131.3404 28.9176 15.6729 121.4547 0.1807 201.9462 41.8136 72.7418 4.7288 27.3985 51.8087 90.8462 42.3110 39.0163 26.1320 1.7923 30.3084 20.0513 1.2437 3.5439 37.1742 91.6587
temp: 298.150 k
press: 1.00000 atm
elementType: 17 17 17 16 8 8 8 8 7 7 6 6 6 6 6 6 6 6 6 6 6 6 6 6 1 1 1 1 1 1 1 1 1 1 1
symmnumber: 1
zpe: 594717.0 jmol-1
zpe.correction: 0.226516 hartree
zpe.thermalcorrener: 0.251233 hartree
zpe.thermalcorrenthalpy: 0.252177 hartree
zpe.thermalcorrgfe: 0.167748 hartree
zpe.sumelectzpe: -2726.745209 hartree
zpe.sumelectthermal: -2726.720491 hartree
zpe.sumelectthermalent: -2726.719547 hartree
zpe.sumelectthermalfe: -2726.803977 hartree
dipole: 7.4051 0.3909 -4.2117
dipole: 8.5279
quadrupole: -112.4810 -169.1861 -175.2028
quadrupole: -8.6312 -0.5429 8.4343
quadrupole: 39.8089 -16.8961 -22.9128 -8.6312 -0.5429 8.4343
hfenergy: -2726.9717245 hartree
pointgroup: C01 [X(C14H11Cl3N2O4S1)]
dipole: 2.9086234 0.4397258 -1.6135668 debye
polarizability: 399.76566|21.72449|266.9907984|-1.1859883|50.4396766|193.4050783 unknown
InChI: InChI=1S/C14H11Cl3N2O4S/c1-23-13-3-2-8(4-12(13)20)7-18-19-24(21,22)14-6-10(16)9(15)5-11(14)17/h2-7,19-20H,1H3
charge 0 multiplicity 1
35 atoms
Cl -4.262073 -1.019747 -2.244437
Cl -2.994217 3.11332 2.520941
Cl -4.704548 4.040301 -0.129108
S  -2.511844 -2.029151 0.551608
O  -3.588726 -3.175079 0.15657
O  -1.839507 -1.987035 2.033817
O  5.751273 1.356873 0.200881
O  3.388924 2.056957 1.228224
N  -1.177955 -2.089861 -0.891618
N  -0.059909 -1.384321 -0.544077
C  -3.172283 -0.273107 0.254958
C  -3.89816 0.109551 -0.887136
C  -2.892523 0.633248 1.290337
C  2.319981 -0.922508 -0.731423
C  -3.357803 1.95734 1.187614
C  -4.361939 1.43722 -0.989394
C  -4.091076 2.354606 0.046201
C  2.265071 0.219738 0.119818
C  3.562372 -1.31731 -1.298014
C  4.679424 0.529324 -0.175887
C  3.43238 0.937981 0.395636
C  1.125644 -1.712258 -1.028502
C  4.744261 -0.595047 -1.02108
C  7.082781 1.038123 -0.322367
H  -2.320772 0.291061 2.160219
H  -1.08508 -3.110069 -1.117907
H  -4.92763 1.755762 -1.868621
H  1.3140 0.532347 0.558179
H  3.607001 -2.192828 -1.955882
H  1.253631 -2.580559 -1.70467
H  5.693687 -0.911966 -1.462556
H  4.30687 2.429747 1.31015
H  7.094104 1.093671 -1.427196
H  7.404767 0.032757 0.008606
H  7.752076 1.80242 0.097713
