program: Gaussian 09
title: 000256492
version: EM64L-G09RevD.01
frameworkgroup: C1[X(C15H27NO2)]
method: RPBEPBE
basis: SDD
operation: Freq
keyword: #p
keyword: freq=noraman
keyword: PBEPBE/SDD
title: #p freq=noraman PBEPBE/SDD
converged: NO YES NO NO
title: Mulliken charges:
elementType: O O N C C C C C C C C C C C C C C C H H H H H H H H H H H H H H H H H H H H H H H H H H H
charge: -0.268757 -0.210880 -0.009091 0.397894 -0.466169 -0.463987 -0.429446 -0.233324 -0.371746 -0.401475 -0.743763 -0.349717 0.192698 -0.697368 -0.217792 -0.702853 -0.260005 -0.666431 0.188149 0.214848 0.192791 0.231007 0.217540 0.211544 0.280381 0.192164 0.233889 0.215336 0.209022 0.232968 0.218481 0.225694 0.200400 0.185052 0.218153 0.216310 0.209519 0.208733 0.220112 0.212371 0.228193 0.240398 0.226653 0.248708 0.223797
chargesum: 0.00000
title: Mulliken charges with hydrogens summed into heavy atoms:
elementType: O O N C C C C C C C C C C C C C C C
charge: -0.268757 -0.210880 -0.009091 0.397894 -0.063173 -0.040189 -0.000361 0.047057 0.054307 0.022883 -0.066620 0.035734 0.192698 -0.053387 -0.217792 -0.061636 0.208585 0.032727
polarizability: 1.90125958e+02 -3.20950927e+00 1.71690850e+02 -9.11985380e+00 6.12438721e+00 1.53571809e+02
1716.lowfreq: -17.8049 -7.9639 -0.0003 0.0003 0.0007 5.8284 19.0330 19.8252 43.1727
frequency: 10.9977 16.7482 42.7642 45.5707 56.2909 65.4940 77.5505 86.1276 92.2547 104.0000 115.8218 127.5864 143.9547 157.4742 194.0574 209.1689 217.3445 227.3692 229.8733 247.1327 270.7279 284.1816 299.2584 307.9220 327.2966 334.2848 364.6644 403.8584 425.4985 472.2172 479.0688 521.1640 574.6576 674.8680 695.6334 720.4722 737.8165 767.3207 773.5904 784.8132 803.6236 824.2826 839.2749 862.5442 892.0764 914.0571 921.8682 940.8704 964.4033 988.6284 1006.0025 1025.7685 1042.2813 1051.5929 1059.6504 1085.7786 1087.2184 1092.1987 1094.8338 1103.9694 1110.0745 1155.6888 1157.4795 1158.9995 1187.7532 1223.6131 1242.2422 1259.6195 1273.9255 1275.9118 1278.4110 1292.3402 1297.5848 1304.7354 1307.3724 1322.5072 1341.4392 1344.3941 1355.0614 1362.6559 1364.1556 1386.6442 1390.1770 1390.4010 1392.7983 1456.2565 1457.7826 1462.3781 1464.0355 1470.2966 1471.0805 1473.9655 1474.6609 1477.9567 1480.0144 1483.0667 1483.5037 1486.3355 1490.7177 1494.7238 1640.9686 2192.7825 2959.2855 2966.8194 2970.8453 2972.8015 2974.4396 2977.8893 2978.4554 2982.0824 2983.6552 2993.3749 3007.3023 3014.3219 3017.9380 3027.1999 3028.4246 3032.4825 3039.4897 3055.9836 3068.7653 3070.6353 3072.3998 3073.3666 3074.9921 3078.6908 3088.6433 3094.5038 3121.5351
redmass: 2.0109 3.8089 2.2407 3.7298 2.2962 2.1149 2.8055 3.3378 4.8993 3.8042 2.4616 3.9507 5.0929 1.9679 1.7899 1.5814 1.5077 1.5672 1.3739 1.9282 2.1508 3.1335 2.7951 2.9783 2.7674 2.4115 4.0298 5.4128 3.8947 3.5857 3.9961 2.9545 3.1439 4.9286 3.9107 1.1234 1.1386 1.2497 2.0378 2.3848 1.3769 2.9349 1.7311 1.7182 1.8217 1.7747 1.9880 1.9628 1.9714 2.4067 2.3547 3.5287 2.1280 2.7619 2.3250 2.3287 2.1283 2.1724 1.9414 2.2145 2.3174 1.8093 2.0045 2.3168 2.6488 1.3631 1.3245 1.3550 1.1989 1.2734 1.1173 1.1381 1.2462 1.4559 1.1563 1.2140 1.4448 1.4401 1.2945 1.4467 1.4854 1.2175 1.2207 1.2183 1.2080 1.0974 1.0720 1.0748 1.0453 1.0642 1.0537 1.0532 1.0578 1.0425 1.0618 1.0623 1.0528 1.0787 1.0634 1.0692 8.7391 12.5742 1.0589 1.0597 1.0588 1.0369 1.0376 1.0580 1.0615 1.0436 1.0615 1.0359 1.0959 1.0967 1.0952 1.0832 1.0959 1.0605 1.1010 1.1013 1.0999 1.0981 1.1005 1.1006 1.0996 1.1006 1.0976 1.1026 1.1066
irintensity: 0.1713 0.4945 0.0894 0.7550 0.3890 0.5844 0.2933 0.4369 0.9226 0.8440 0.1224 0.7657 4.1173 0.1789 1.0774 2.0501 0.9255 0.9115 0.0156 0.0456 0.1012 1.7402 3.8771 6.8958 0.7182 0.4073 3.2487 2.9189 2.4950 1.7140 1.1192 3.0475 0.9606 4.0261 13.8757 6.5486 9.1672 6.2176 3.2145 0.8114 4.6718 3.5527 3.0170 6.4755 5.2217 5.8198 0.6834 6.9982 5.2492 5.8829 12.6897 71.1237 6.6932 0.7254 1.0867 27.0541 143.0965 5.7598 29.0106 103.8240 8.8591 32.7223 14.1832 12.0471 17.4771 3.3352 12.7185 12.4340 4.9379 4.8333 4.0558 1.6420 19.3890 29.5772 5.5995 4.3297 6.0673 0.8072 1.7237 0.8555 1.2974 12.3634 33.9692 2.9641 18.7679 13.4228 1.5149 0.9023 17.5123 0.7338 3.6149 7.4096 5.9449 12.3519 2.6269 21.9097 10.9032 21.0536 7.4723 17.8306 139.5247 9.9245 24.8277 13.3283 8.7185 29.6418 41.8098 4.4968 15.1794 22.3660 100.1514 15.4332 18.0303 7.0664 2.2205 3.1504 30.0262 23.6078 27.7781 17.9489 69.7379 45.4084 21.7077 112.1096 40.5840 65.2126 35.7471 2.2269 27.4482
temp: 298.150 k
press: 1.00000 atm
elementType: 8 8 7 6 6 6 6 6 6 6 6 6 6 6 6 6 6 6 1 1 1 1 1 1 1 1 1 1 1 1 1 1 1 1 1 1 1 1 1 1 1 1 1 1 1
symmnumber: 1
zpe: 1029689.6 jmol-1
zpe.correction: 0.392188 hartree
zpe.thermalcorrener: 0.415277 hartree
zpe.thermalcorrenthalpy: 0.416221 hartree
zpe.thermalcorrgfe: 0.336947 hartree
zpe.sumelectzpe: -791.523545 hartree
zpe.sumelectthermal: -791.500457 hartree
zpe.sumelectthermalent: -791.499512 hartree
zpe.sumelectthermalfe: -791.578787 hartree
dipole: 2.4746 -2.9704 -3.8156
dipole: 5.4319
quadrupole: -97.5097 -116.1697 -124.2081
quadrupole: 1.4459 2.0200 -4.3909
quadrupole: 15.1195 -3.5406 -11.5789 1.4459 2.0200 -4.3909
hfenergy: -791.9157334 hartree
pointgroup: C01 [X(C15H27N1O2)]
dipole: -1.1583187 -1.278166 1.2616466 debye
polarizability: 191.2983604|2.5718919|172.3334641|-8.0349004|-1.6631065|151.7567913 unknown
InChI: InChI=1S/C15H27NO2/c1-5-9-11-15(7-3,10-6-2)13(12-16)14(17)18-8-4/h13H,5-11H2,1-4H3
charge 0 multiplicity 1
45 atoms
O  -2.92733 0.057233 -0.605365
O  -1.565589 1.88211 -0.088909
N  0.821893 1.115375 -2.919283
C  0.28954 -0.864286 0.093275
C  0.857621 0.186913 1.101437
C  1.424175 -1.668319 -0.620198
C  -0.652254 -1.812362 0.915789
C  -0.585007 -0.189251 -1.066095
C  1.855831 1.246485 0.584812
C  2.363301 -2.480566 0.300976
C  -1.307383 -2.992494 0.165694
C  2.371599 2.145688 1.733637
C  -1.703024 0.721425 -0.530236
C  3.457373 -3.212903 -0.507772
C  0.207324 0.551803 -2.066207
C  3.362021 3.225243 1.24752
C  -4.125238 0.80467 -0.096806
C  -4.273858 0.633008 1.416701
H  1.34353 -0.383232 1.919674
H  0.006879 0.718194 1.57241
H  0.966791 -2.362985 -1.354822
H  2.042358 -0.968772 -1.215577
H  -1.448426 -1.200011 1.384324
H  -0.052398 -2.212955 1.75588
H  -1.076813 -1.017691 -1.609409
H  2.723376 0.762952 0.092552
H  1.372988 1.886587 -0.17588
H  2.844256 -1.80809 1.037172
H  1.78429 -3.224667 0.88251
H  -2.024873 -2.652149 -0.602459
H  -1.874636 -3.62039 0.877236
H  -0.557484 -3.642185 -0.320699
H  1.505823 2.632781 2.226923
H  2.857733 1.513509 2.506014
H  4.124445 -3.795555 0.153505
H  4.081775 -2.494848 -1.071526
H  3.010334 -3.912463 -1.239148
H  4.249925 2.765728 0.773222
H  2.887169 3.884865 0.497682
H  3.713897 3.858547 2.082837
H  -4.960758 0.351098 -0.652652
H  -4.012427 1.867274 -0.37441
H  -4.321563 -0.435084 1.691165
H  -3.433305 1.106695 1.950847
H  -5.209382 1.116874 1.753051
