program: Gaussian 09
title: 000264500
version: EM64L-G09RevD.01
frameworkgroup: C1[X(C11H16O)]
method: RPBEPBE
basis: SDD
operation: Freq
keyword: #pfreq=noraman
keyword: PBEPBE/SDD
title: #p freq=noraman PBEPBE/SDD
converged: YES YES NO NO
title: Mulliken charges:
elementType: O C C C C C C C C C C C H H H H H H H H H H H H H H H H
charge: -0.203056 0.321219 -0.104350 -0.484927 -0.476561 -0.585324 -0.519519 -0.241680 -0.782963 -0.451473 0.199890 -0.206511 0.212807 0.213067 0.236628 0.206993 0.223309 0.240634 0.228889 0.222340 0.246097 0.215858 0.214721 0.228278 0.217314 0.213663 0.214150 0.200506
chargesum: 0.00000
title: Mulliken charges with hydrogens summed into heavy atoms:
elementType: O C C C C C C C C C C C
charge: -0.203056 0.321219 0.108457 -0.035231 -0.046259 -0.115801 -0.051082 -0.025822 -0.122650 -0.023660 0.199890 -0.006005
polarizability: 1.26444824e+02 3.02142311e+00 1.17263563e+02 2.24133604e-01 -3.39616523e-01 9.22843697e+01
1716.lowfreq: -14.5711 -4.4127 0.0005 0.0005 0.0007 19.2015 64.3831 95.0893 167.5587
frequency: 64.3377 94.9761 167.5432 186.0168 229.5784 252.6841 283.3335 301.5337 373.3189 390.2136 419.9579 428.4274 465.0266 485.8557 516.5190 536.5996 659.1484 679.1362 719.5714 734.2391 755.2097 804.9040 862.4637 873.9048 896.3451 916.8994 951.9215 964.6477 977.4820 994.0451 1007.3913 1026.8503 1043.3859 1062.0985 1104.4400 1122.3984 1143.8940 1159.1205 1168.2568 1188.7809 1225.0741 1233.0381 1241.4615 1259.7780 1276.4025 1300.1961 1309.3673 1330.7079 1335.5876 1345.8605 1352.2101 1376.2003 1392.1780 1441.0016 1451.1272 1457.3219 1465.7625 1476.3837 1483.8498 1487.1669 1632.6434 1670.0103 2953.4308 2959.2636 2973.7968 2976.1592 2981.0352 2983.3229 2989.9935 3008.8112 3038.3919 3045.1892 3060.1615 3066.1835 3070.9104 3074.0495 3075.3730 3113.9590
redmass: 6.6202 2.7844 2.3308 2.3860 1.3745 2.0741 2.2652 2.4892 2.4571 2.6974 2.6039 2.7457 2.5251 3.1996 3.0335 3.3899 3.8477 3.1897 1.5787 2.1170 2.0630 2.1114 1.7906 2.5605 2.0024 2.2088 1.6715 1.7841 1.2679 2.0772 1.6869 1.8845 2.2183 1.7726 1.8113 1.6533 1.6352 1.7859 1.5295 1.4662 1.4543 1.9239 1.2741 1.5482 1.6932 1.3637 1.4123 1.5562 1.5466 1.4953 1.4928 1.4216 1.3026 1.0874 1.0830 1.0866 1.0887 1.0630 1.0532 1.0793 9.2297 7.1260 1.0642 1.0779 1.0378 1.0657 1.0629 1.0656 1.0613 1.0918 1.1024 1.1009 1.0964 1.0983 1.0979 1.0982 1.0849 1.0977
irintensity: 4.0012 1.1817 0.8460 0.3462 0.0863 0.3902 0.2977 0.2864 0.9955 1.1232 3.4754 1.0963 1.6904 8.2194 0.8467 0.6499 1.5058 3.4391 31.0510 3.0448 9.7559 7.7266 2.1636 2.0385 5.1322 6.5098 2.9184 4.6933 0.0180 14.3279 5.0682 2.2896 7.1274 3.4018 4.0017 10.8705 1.8847 15.1917 17.9043 0.6901 5.0785 12.3179 4.6169 5.9064 1.2236 10.5084 2.2958 6.0035 3.0022 0.2827 1.4399 7.6539 11.3333 21.6678 18.6416 6.1169 11.9929 13.5868 3.1731 13.6655 176.8241 3.9746 41.1967 16.6348 22.2561 13.7560 41.9054 29.4240 19.7664 38.8093 51.3017 20.4596 30.5004 23.3932 45.9150 19.8537 15.0432 59.1337
temp: 298.150 k
press: 1.00000 atm
elementType: 8 6 6 6 6 6 6 6 6 6 6 6 1 1 1 1 1 1 1 1 1 1 1 1 1 1 1 1
symmnumber: 1
zpe: 639558.4 jmol-1
zpe.correction: 0.243595 hartree
zpe.thermalcorrener: 0.254618 hartree
zpe.thermalcorrenthalpy: 0.255562 hartree
zpe.thermalcorrgfe: 0.207563 hartree
zpe.sumelectzpe: -503.052544 hartree
zpe.sumelectthermal: -503.041522 hartree
zpe.sumelectthermalent: -503.040577 hartree
zpe.sumelectthermalfe: -503.088576 hartree
dipole: -2.7725 1.8579 0.9673
dipole: 3.4748
quadrupole: -83.7236 -72.3176 -72.0821
quadrupole: 8.7873 3.2662 -1.9948
quadrupole: -7.6825 3.7235 3.9590 8.7873 3.2662 -1.9948
hfenergy: -503.2961391 hartree
pointgroup: C01 [X(C11H16O1)]
dipole: 1.109382 -0.6902301 0.4022492 debye
polarizability: 126.2823032|3.2458639|117.4221941|-0.3395027|-0.4551566|92.2882587 unknown
InChI: InChI=1S/C11H16O/c1-11-6-3-2-4-9(11)8-10(12)5-7-11/h3,6,9H,2,4-5,7-8H2,1H3
charge 0 multiplicity 1
28 atoms
O  -3.111434 1.110782 -0.435204
C  0.53865 -0.890141 0.160579
C  0.21466 0.493429 0.824782
C  -0.406036 -1.148434 -1.06215
C  0.733424 1.671437 -0.03946
C  -1.302096 0.65135 1.146919
C  -1.916188 -1.004092 -0.725825
C  1.981561 -0.895421 -0.344355
C  0.391901 -2.037426 1.200875
C  2.270296 1.616712 -0.19584
C  -2.201177 0.330838 -0.044391
C  2.755166 0.210615 -0.49564
H  0.764314 0.527838 1.789449
H  -0.213219 -2.162256 -1.463572
H  -0.150528 -0.438784 -1.871032
H  0.433757 2.63107 0.424132
H  0.256584 1.646679 -1.039108
H  -1.523797 1.675398 1.496472
H  -1.57467 -0.045876 1.96633
H  -2.222334 -1.817647 -0.036537
H  -2.536944 -1.085392 -1.634882
H  2.395292 -1.883279 -0.598252
H  0.650765 -3.01177 0.745159
H  1.072862 -1.874294 2.056216
H  -0.636287 -2.11888 1.59715
H  2.761146 1.984578 0.730715
H  2.597501 2.304842 -1.000704
H  3.789533 0.099326 -0.850923
