program: Gaussian 09
title: 000264524
version: EM64L-G09RevD.01
frameworkgroup: C1[X(C13H19N5O2S2)]
method: RPBEPBE
basis: SDD
operation: Freq
keyword: #p
keyword: freq=noraman
keyword: PBEPBE/SDD
title: #p freq=noraman PBEPBE/SDD
converged: YES YES NO NO
title: Mulliken charges:
elementType: S S O O N N N N N C C C C C C C C C C C C C H H H H H H H H H H H H H H H H H H H
charge: 0.256481 0.003242 -0.245735 -0.264330 -0.101296 -0.084201 -0.366217 -0.133494 -0.067799 -0.340274 -0.355583 -0.283465 -0.315706 -0.309352 -0.667372 0.098051 0.140896 -0.187096 0.146084 -0.265163 -0.621389 -0.607916 0.199531 0.211983 0.212134 0.196889 0.234467 0.217283 0.193343 0.216106 0.216572 0.192843 0.271053 0.298498 0.346644 0.263285 0.252950 0.263486 0.258669 0.258537 0.267360
chargesum: 0.00000
title: Mulliken charges with hydrogens summed into heavy atoms:
elementType: S S O O N N N N N C C C C C C C C C C C C C
charge: 0.256481 0.003242 -0.245735 -0.264330 -0.101296 -0.084201 -0.019573 -0.133494 -0.067799 0.071240 0.053440 0.168285 0.093744 0.100063 -0.097821 0.098051 0.140896 -0.187096 0.146084 -0.265163 0.158332 0.176650
polarizability: 3.08309111e+02 -2.48190501e+01 2.54592957e+02 1.29757245e+01 7.47011842e+00 1.27066316e+02
1716.lowfreq: -7.2381 -5.5108 -3.6768 -0.0019 -0.0014 0.0004 12.7426 15.4115 20.4757
frequency: 12.3418 14.7125 20.0163 54.1236 70.0320 82.0564 90.4770 114.6163 126.2241 164.6719 172.4500 177.7405 186.5853 213.9543 219.8473 243.3663 254.6097 276.7901 308.7101 317.4964 326.2477 337.7053 353.4979 356.1701 380.6555 398.2031 404.8457 426.7561 457.4016 469.2754 474.7973 565.3032 595.0718 615.3962 627.8789 636.3582 639.9411 662.1900 677.1527 718.8954 735.4595 744.8850 768.9605 805.5704 841.3702 854.8493 893.8713 926.1261 948.1425 994.0069 1012.9525 1026.2090 1045.2794 1050.3390 1055.5637 1083.7065 1095.9463 1100.8270 1115.1775 1125.8102 1127.9210 1128.8822 1132.2627 1169.9590 1190.9074 1192.6137 1203.9818 1238.4151 1242.4862 1264.6484 1268.8036 1273.3119 1294.2417 1295.2778 1302.3612 1330.6574 1332.0851 1344.2166 1359.1266 1373.1472 1374.4529 1384.4091 1394.0135 1426.6798 1429.9367 1438.4799 1444.7855 1449.4731 1452.5550 1457.0336 1460.8148 1467.0626 1470.7277 1473.6193 1475.5393 1508.5326 1582.8360 1660.7593 2873.7029 2880.7063 2922.5664 2956.7044 2960.4377 3008.6166 3009.8040 3030.3534 3038.9991 3042.9036 3054.9516 3082.5462 3085.6911 3100.4676 3102.2709 3132.6142 3135.0401 3136.5640 3586.0597
redmass: 5.4970 3.8987 4.5333 5.1765 5.1615 4.9945 4.4891 6.4060 4.0882 1.0832 1.6565 1.5449 3.9394 5.5332 3.3745 1.8177 6.2896 10.9405 3.5737 6.5904 2.6269 5.3274 3.0171 5.9964 4.6976 2.1939 4.2088 7.1829 6.7838 2.8012 8.1592 7.2018 1.9828 9.1329 9.5173 5.5980 1.4877 5.0981 4.2272 4.8281 11.1707 1.3425 2.9920 3.7387 1.6001 4.9629 2.3257 8.3060 8.1834 2.6785 1.6650 2.1971 3.2190 2.7917 2.4474 3.5171 3.2988 2.1498 2.4997 1.9877 1.3056 1.3110 2.6155 1.9303 1.0623 2.4876 1.4032 1.2088 6.7958 1.3749 5.4360 1.2999 5.6419 1.3395 1.2306 4.0943 1.4957 1.2509 1.3814 1.2614 5.3595 1.4568 3.1947 1.1269 1.2112 1.2089 1.0830 1.0778 1.0937 1.0600 1.0816 1.0432 1.1204 1.1460 1.0988 3.5567 8.0512 11.0465 1.0705 1.0691 1.0681 1.0665 1.0665 1.0325 1.0325 1.0905 1.0900 1.0926 1.0577 1.0963 1.0981 1.1018 1.1017 1.1029 1.1025 1.1080 1.0822
irintensity: 0.0620 0.1507 0.1170 0.1347 0.9760 0.9101 2.1714 0.2232 0.7282 1.1820 2.8492 3.9126 18.2852 1.1742 5.5416 1.1146 8.2617 3.9445 5.6710 0.1958 13.4989 8.3592 4.2407 0.0384 11.3743 0.8526 7.5618 27.5700 3.3646 1.0002 7.5988 0.3236 6.3834 1.8052 0.3563 5.2649 83.1280 57.0891 19.9508 0.8068 6.3529 11.8859 10.0623 26.1398 0.4593 0.0851 12.7300 15.1342 15.7308 30.7024 4.6631 8.1037 44.3187 30.8416 3.5394 34.6682 102.5480 21.2096 111.5930 22.5336 1.0487 0.0498 77.6096 22.3761 1.6037 14.1987 7.4393 7.6235 22.7046 30.6603 119.5036 4.0538 87.2750 15.4189 21.4122 27.6258 1.8371 6.8393 1.5009 1.9424 6.5634 38.9937 524.5258 19.8141 124.8886 27.3806 3.1938 2.0838 20.0286 18.0471 7.3303 18.7268 35.7755 20.6466 15.6827 95.5017 102.5711 543.9768 49.9215 89.5341 60.7141 32.7288 107.0674 17.0489 17.9851 34.2691 28.7089 34.6729 14.3769 36.8698 32.4364 5.8230 15.3695 2.2089 2.2548 3.7050 104.5370
temp: 298.150 k
press: 1.00000 atm
elementType: 16 16 8 8 7 7 7 7 7 6 6 6 6 6 6 6 6 6 6 6 6 6 1 1 1 1 1 1 1 1 1 1 1 1 1 1 1 1 1 1 1
symmnumber: 1
zpe: 849513.9 jmol-1
zpe.correction: 0.323563 hartree
zpe.thermalcorrener: 0.345441 hartree
zpe.thermalcorrenthalpy: 0.346385 hartree
zpe.thermalcorrgfe: 0.269383 hartree
zpe.sumelectzpe: -1725.443847 hartree
zpe.sumelectthermal: -1725.421969 hartree
zpe.sumelectthermalent: -1725.421024 hartree
zpe.sumelectthermalfe: -1725.498026 hartree
dipole: -4.0207 3.0488 -0.3071
dipole: 5.0552
quadrupole: -161.0119 -155.8552 -144.3946
quadrupole: -8.2503 -1.9601 2.3118
quadrupole: -7.2580 -2.1013 9.3593 -8.2503 -1.9601 2.3118
hfenergy: -1725.7674095 hartree
pointgroup: C01 [X(C13H19N5O2S2)]
dipole: 1.5279972 -1.0931872 -0.6524849 debye
polarizability: 305.4871594|-17.8000712|240.3501214|-26.7623586|43.4036408|144.1311035 unknown
InChI: InChI=1S/C13H19N5O2S2/c1-16-10-9(11(19)17(2)13(16)21)14-12(15-10)22-8-5-18-3-6-20-7-4-18/h14H,3-8H2,1-2H3
charge 0 multiplicity 1
41 atoms
S  1.030319 -2.659668 -1.808262
S  -3.805236 2.87312 1.181353
O  5.723416 1.839236 0.886698
O  -4.577251 -2.008113 -0.193119
N  4.067147 -0.290474 -0.17472
N  -1.906103 1.199275 0.180643
N  -1.581905 -2.145873 -0.972136
N  -4.109057 0.253272 0.414907
N  -0.193703 -0.35328 -0.74262
C  3.510241 1.066168 0.07375
C  5.175919 -0.580617 0.77092
C  3.032255 -1.346687 -0.235047
C  4.624781 2.117168 -0.053657
C  6.267051 0.494847 0.63206
C  2.45619 -1.407593 -1.661503
C  -2.357917 -1.102156 -0.448758
C  -1.477528 -0.021697 -0.319569
C  -0.295507 -1.652957 -1.133877
C  -3.744739 -1.056367 -0.092345
C  -3.251427 1.36888 0.56379
C  -0.95061 2.319527 0.308231
C  -5.526906 0.420405 0.81216
H  3.058242 1.132003 1.094914
H  2.711874 1.278329 -0.66105
H  5.605015 -1.571828 0.53141
H  4.819891 -0.602638 1.830892
H  2.207809 -1.176258 0.494699
H  3.497215 -2.318864 0.010981
H  5.013902 2.122459 -1.094656
H  4.25802 3.122392 0.211948
H  7.06472 0.352561 1.379661
H  6.699192 0.453003 -0.391062
H  3.206785 -1.755337 -2.388681
H  2.045241 -0.438935 -1.982657
H  -1.927483 -3.081101 -1.187864
H  -1.285133 3.171094 -0.306819
H  0.031636 1.956366 -0.029196
H  -0.905327 2.656194 1.356884
H  -5.987463 1.231576 0.224993
H  -5.588953 0.693029 1.878393
H  -6.032811 -0.537657 0.622908
