program: Gaussian 09
title: 000264548
version: EM64L-G09RevD.01
frameworkgroup: C1[X(C19H19NO4)]
method: RPBEPBE
basis: SDD
operation: Freq
keyword: #p
keyword: freq=noraman
keyword: PBEPBE/SDD
title: #p freq=noraman PBEPBE/SDD
converged: YES YES NO NO
title: Mulliken charges:
elementType: O O O O N C C C C C C C C C C C C C C C C C C C H H H H H H H H H H H H H H H H H H H
charge: -0.431664 -0.235002 -0.263841 -0.252366 -0.219419 -0.026352 0.330080 0.281083 0.092862 -0.558420 -0.555182 -0.400972 -0.325528 0.490454 0.289900 -0.253871 -0.220652 -0.446004 -0.390166 -0.221768 -0.238790 -0.265086 -0.246283 -0.664093 0.270146 0.257482 0.233579 0.265344 0.251100 0.259882 0.358415 0.228175 0.226914 0.230488 0.308197 0.225555 0.227271 0.236150 0.226630 0.227210 0.219357 0.229572 0.249613
chargesum: 0.00000
title: Mulliken charges with hydrogens summed into heavy atoms:
elementType: O O O O N C C C C C C C C C C C C C C C C C C C
charge: -0.073249 -0.235002 -0.263841 -0.252366 -0.219419 -0.026352 0.330080 0.281083 0.092862 -0.030792 -0.056260 -0.149872 -0.065646 0.490454 0.289900 -0.025696 0.006262 -0.215516 -0.081969 0.003787 -0.011518 0.197694 -0.019073 0.034449
polarizability: 2.50631385e+02 -7.55675501e+00 1.92482891e+02 -1.00235379e+01 2.76357916e+00 2.03294669e+02
1716.lowfreq: -20.4756 -3.5794 -1.7828 -0.0010 -0.0008 -0.0007 5.3396 29.4143 33.9469
frequency: -18.5675 29.2223 33.9434 39.7256 53.1017 63.5496 84.3156 92.7145 98.8682 132.8597 165.0940 170.0903 177.3014 215.3998 220.2114 236.0996 267.1557 284.0884 286.0306 329.4908 332.2182 360.7718 380.7324 383.6065 406.3841 442.2113 460.3866 474.7870 484.4772 530.3917 550.2925 570.5955 606.6563 612.1379 621.4014 662.2587 675.9645 699.1117 709.4879 729.1758 745.2197 754.0794 761.8939 791.6727 797.3130 807.8768 815.5799 862.9194 867.7916 869.4567 906.4207 925.4807 941.7788 979.3987 982.0295 984.5621 986.4355 989.8300 1005.9767 1012.4674 1015.7953 1024.6330 1029.2593 1042.4473 1085.3032 1092.4178 1095.4007 1111.9541 1145.7757 1156.8749 1169.7940 1172.5974 1173.8524 1194.9226 1206.9706 1210.5830 1234.1009 1271.1794 1276.2465 1301.8614 1306.6524 1335.2749 1341.7104 1356.2079 1358.9688 1362.2919 1388.2795 1389.5124 1409.8121 1432.5445 1444.3573 1454.9971 1457.3842 1463.3974 1466.1907 1484.3524 1484.7469 1487.7441 1595.3375 1605.7056 1615.4793 1626.6463 1631.0623 1653.2739 2977.9650 2991.7352 2993.2151 3031.5571 3031.9478 3088.7090 3093.7603 3093.8695 3109.8334 3120.3032 3125.8729 3132.9631 3138.9330 3144.9637 3151.8363 3160.9018 3163.1269 3171.9646 3485.6266
redmass: 3.7172 3.6726 5.0042 4.3059 3.9040 5.1297 7.4410 4.8678 5.5992 4.2464 4.6068 4.2730 4.2153 1.3920 4.3094 4.0875 4.4081 2.3826 3.8689 3.2691 6.0605 4.0245 2.3281 1.4074 2.8581 3.5035 3.2634 5.1265 4.8918 4.6072 4.9520 4.0045 4.1713 5.7943 5.6910 5.3258 4.7018 5.5031 2.1961 3.4200 1.7468 4.2000 1.3873 2.2089 3.5978 2.8310 2.0175 1.2683 2.8031 1.3972 3.6892 1.4392 1.4357 3.0043 1.5377 1.8190 1.8190 4.5888 1.6930 2.8722 2.1302 2.8189 2.3454 2.7266 2.2526 1.9869 2.1939 2.1571 2.5928 1.7030 1.6450 1.0906 1.1342 1.1548 1.3183 2.4986 2.0433 1.3606 1.1205 1.7952 1.8788 1.7088 2.3189 1.5172 1.6508 1.8881 4.1850 1.2397 4.0521 1.0950 2.0963 1.9265 1.0964 1.0449 1.3747 3.3271 1.0590 2.1556 6.0776 7.5517 5.8206 7.9544 8.8699 10.2671 1.0597 1.0654 1.0360 1.0596 1.1011 1.0974 1.1022 1.0960 1.0877 1.1065 1.0865 1.0856 1.0920 1.0909 1.0954 1.0953 1.1013 1.0995 1.0655
irintensity: 0.5549 0.0847 0.6044 0.1848 0.1569 0.2657 2.6055 0.6152 0.5877 1.7101 6.4439 0.5199 3.8835 4.5643 7.9030 2.4004 5.2371 14.3354 0.4264 15.4722 8.7546 9.8997 71.3060 70.7577 0.2404 1.4594 9.7669 4.6167 2.9400 16.4308 4.3596 4.0403 8.2095 3.2535 9.3194 9.3111 6.1206 4.2445 39.5614 7.4768 43.2316 3.3267 94.0656 13.2208 10.9246 7.5234 3.2294 0.2159 1.4116 0.9187 34.9471 5.8169 13.4730 77.0983 15.6600 14.0645 1.9324 0.5530 5.3102 77.4042 19.1491 7.3662 11.8883 19.7688 1.4433 29.1363 26.6201 67.6420 155.5271 32.9237 78.4852 6.5005 15.2894 0.9123 30.6471 0.2146 3.5238 8.3433 4.3012 49.8417 99.6119 20.9283 57.7466 22.2695 14.9064 4.1221 2.5434 22.0040 4.5794 38.9767 13.5474 31.1127 12.0319 13.9998 38.9170 85.3875 10.8984 18.6706 3.3392 60.4356 4.6003 136.8484 208.6840 172.1031 30.3048 6.3518 18.7337 22.7965 6.4626 28.9311 0.8184 1.5579 10.0342 33.6013 3.1551 0.7852 40.8888 12.0207 1.6428 22.7603 38.2821 12.2221 15.1425
temp: 298.150 k
press: 1.00000 atm
elementType: 8 8 8 8 7 6 6 6 6 6 6 6 6 6 6 6 6 6 6 6 6 6 6 6 1 1 1 1 1 1 1 1 1 1 1 1 1 1 1 1 1 1 1
symmnumber: 1
zpe: 890221.9 jmol-1
zpe.correction: 0.339068 hartree
zpe.thermalcorrener: 0.360248 hartree
zpe.thermalcorrenthalpy: 0.361192 hartree
zpe.thermalcorrgfe: 0.288018 hartree
zpe.sumelectzpe: -1089.364427 hartree
zpe.sumelectthermal: -1089.343246 hartree
zpe.sumelectthermalent: -1089.342302 hartree
zpe.sumelectthermalfe: -1089.415476 hartree
dipole: 0.2355 1.5841 2.8629
dipole: 3.2804
quadrupole: -122.8274 -134.3504 -140.2687
quadrupole: 10.5667 -0.3690 3.2671
quadrupole: 9.6547 -1.8682 -7.7865 10.5667 -0.3690 3.2671
hfenergy: -1089.7034943 hartree
pointgroup: C01 [X(C19H19N1O4)]
dipole: -0.0386621 -0.9531292 -0.8693341 debye
polarizability: 241.525043|-11.8339661|196.1382177|20.7925784|-0.6510399|208.7456852 unknown
InChI: InChI=1S/C19H19NO4/c1-2-24-17(21)12-19(23)15-10-6-7-11-16(15)20(18(19)22)13-14-8-4-3-5-9-14/h3-11,23H,2,12-13H2,1H3
charge 0 multiplicity 1
43 atoms
O  2.982488 1.868055 1.249851
O  0.29903 1.495852 2.543864
O  2.419596 -2.815671 0.799375
O  0.369688 -1.707205 0.853086
N  -0.202321 1.511866 0.2197
C  2.007518 0.836655 0.838617
C  1.84656 0.850153 -0.668273
C  0.519484 1.247483 -0.982515
C  0.600538 1.290366 1.335599
C  2.445285 -0.513775 1.460166
C  -1.575981 2.023129 0.307898
C  2.756216 0.545286 -1.687658
C  0.072931 1.348594 -2.310848
C  -2.638811 1.087819 -0.266462
C  1.613752 -1.70105 1.011329
C  2.326911 0.646291 -3.037916
C  1.002653 1.042339 -3.337574
C  -3.777508 1.638394 -0.9045
C  -2.530012 -0.31862 -0.129057
C  -4.805515 0.798766 -1.390101
C  -3.556599 -1.156041 -0.619785
C  1.723237 -4.083608 0.403975
C  -4.697481 -0.603714 -1.247929
C  1.244778 -4.845958 1.642026
H  3.507273 -0.689708 1.22481
H  2.347353 -0.425198 2.561406
H  -1.632879 3.01063 -0.191303
H  -1.755184 2.186533 1.388485
H  3.783002 0.248874 -1.449192
H  -0.954977 1.633958 -2.55168
H  2.770639 2.112727 2.19247
H  3.023578 0.418187 -3.851286
H  0.682739 1.1110 -4.383332
H  -3.864262 2.726854 -1.019514
H  -1.645311 -0.755919 0.346462
H  -5.682991 1.236248 -1.879713
H  -3.464172 -2.242715 -0.511386
H  0.882917 -3.825166 -0.263802
H  2.496977 -4.636176 -0.152011
H  -5.491278 -1.258185 -1.625463
H  0.814281 -5.817616 1.336371
H  2.083096 -5.043151 2.332138
H  0.465461 -4.278683 2.177973
