program: Gaussian 09
title: 000264573
version: EM64L-G09RevD.01
frameworkgroup: C1[X(C15H14Cl3N3O2S)]
method: RPBEPBE
basis: SDD
operation: Freq
keyword: #p
keyword: freq=noraman
keyword: PBEPBE/SDD
title: #p freq=noraman PBEPBE/SDD
converged: YES YES NO NO
title: Mulliken charges:
elementType: Cl Cl Cl S O O N N N C C C C C C C C C C C C C C C H H H H H H H H H H H H H H
charge: 0.026025 0.009638 0.013795 0.925465 -0.514920 -0.530888 -0.144647 -0.392230 -0.035294 0.416263 0.002589 0.477991 -0.342040 -0.327809 -0.401651 -0.375287 -0.127074 -0.186075 -0.644380 -0.644283 -0.360340 -0.076245 -0.178447 -0.079494 0.242723 0.244125 0.227262 0.273605 0.326454 0.252047 0.242003 0.223720 0.243253 0.243481 0.245318 0.222769 0.213298 0.289280
chargesum: 0.00000
title: Mulliken charges with hydrogens summed into heavy atoms:
elementType: Cl Cl Cl S O O N N N C C C C C C C C C C C C C C C
charge: 0.026025 0.009638 0.013795 0.925465 -0.514920 -0.530888 -0.144647 -0.140183 -0.035294 0.416263 0.002589 0.477991 -0.099317 -0.083684 -0.174389 -0.101682 -0.127074 0.140378 0.064597 0.067284 -0.147042 -0.076245 0.110833 -0.079494
polarizability: 5.82260844e+02 6.87756911e+01 3.18751290e+02 -1.37290399e+01 5.27161996e+00 1.70921897e+02
1716.lowfreq: -0.0009 0.0012 0.0021 2.5476 3.1531 4.1937 7.6794 12.3429 17.1277
frequency: 6.2135 12.1258 17.0824 38.6734 45.8495 61.7918 69.9551 74.6047 107.1477 111.5898 118.6953 125.7638 143.0366 155.6541 172.2812 176.5903 181.7636 192.6846 197.5479 225.8996 234.4232 252.2607 257.0953 301.4211 313.6554 324.4431 340.8506 361.6244 400.3461 410.7667 428.3506 447.4755 454.7383 459.4790 473.3959 484.0631 514.9385 528.2623 571.8426 580.1420 603.7960 629.8433 658.9481 696.9947 726.4916 741.7553 789.0780 799.9098 805.2893 833.4112 858.4593 865.0707 880.9503 916.1988 919.8637 926.6944 939.5334 957.4804 987.1239 992.0922 993.7035 1021.7519 1056.1562 1089.5858 1102.3185 1112.7164 1129.0914 1134.6006 1166.6718 1197.6643 1225.2749 1252.1919 1256.2537 1291.5096 1305.4839 1326.1525 1347.2675 1370.7602 1372.6490 1378.5741 1414.7144 1432.0638 1453.0733 1462.2597 1466.5138 1479.9447 1487.4592 1497.3650 1507.7823 1538.1968 1551.3983 1555.4101 1567.0275 1630.3444 2955.2287 2959.2352 2961.8402 3026.0885 3027.7190 3030.3366 3106.2900 3116.1669 3123.1071 3143.0324 3153.4926 3170.5909 3175.7230 3179.2856
redmass: 7.6049 3.8105 10.7074 7.6733 8.7234 7.4016 3.6655 3.4961 8.8259 9.7406 10.7785 1.9298 3.0690 4.2567 7.5102 16.1232 3.6585 2.0129 3.3366 8.8170 3.0756 4.1701 5.1446 6.1831 24.9597 6.2033 4.3423 14.0635 5.4391 5.5657 3.2200 7.2596 3.4708 4.4039 4.3752 5.5574 4.9201 2.4053 9.4816 4.4104 11.9311 7.1646 7.5777 3.6193 4.8074 3.4656 12.4945 8.1605 1.3946 1.6107 4.1919 1.4831 1.3432 1.9787 1.5423 5.7798 3.0466 1.4489 1.3571 2.9521 7.9348 3.6247 1.5251 1.7752 1.2368 1.3337 5.5032 1.4738 1.6754 1.1250 1.1865 2.7867 1.4002 1.5974 9.0057 1.4000 2.0526 10.6405 3.1336 4.5516 2.7509 1.1995 1.6528 1.9331 1.0414 1.0460 1.3086 1.7434 1.2983 4.1770 9.4994 4.4489 8.5673 6.1337 1.0368 1.0851 1.0398 1.1003 1.0721 1.1025 1.0971 1.0951 1.0896 1.0918 1.0877 1.0933 1.0961 1.0931
irintensity: 0.5149 2.1964 0.6989 0.1581 0.8974 2.3031 1.3467 0.9487 18.1911 94.0803 9.8748 6.1302 11.0345 13.3311 33.4700 0.9784 41.3474 0.4580 44.8190 2.3556 5.1604 22.8272 6.9602 57.7226 0.1218 8.8913 12.3516 117.4477 25.1409 9.5577 4.1201 31.1531 18.8758 21.3053 29.7247 2.1834 8.6199 19.8525 20.6207 4.7209 9.8965 0.2541 21.1313 1.4780 7.0546 1.1070 54.5091 106.1759 31.0930 64.1310 7.6805 15.8542 66.1153 29.3773 40.8197 30.1753 38.8296 10.7920 2.5519 2.7175 88.0838 41.3110 24.8180 71.5999 0.0104 0.9533 90.5932 2.0498 2.2079 175.2640 19.4052 20.1660 22.4114 38.2256 29.8744 18.7637 90.9401 5.0865 153.5668 130.7344 128.0304 22.5945 184.7243 0.0527 0.3078 27.3113 103.5216 126.9680 386.1661 34.1351 39.1651 28.4743 11.6367 694.9425 84.0251 70.2604 174.7945 13.6115 117.1480 52.3601 3.5289 44.8631 9.2291 42.8676 1.6982 21.3606 16.2978 0.7188
temp: 298.150 k
press: 1.00000 atm
elementType: 17 17 17 16 8 8 7 7 7 6 6 6 6 6 6 6 6 6 6 6 6 6 6 6 1 1 1 1 1 1 1 1 1 1 1 1 1 1
symmnumber: 1
zpe: 689082.4 jmol-1
zpe.correction: 0.262458 hartree
zpe.thermalcorrener: 0.287998 hartree
zpe.thermalcorrenthalpy: 0.288943 hartree
zpe.thermalcorrgfe: 0.201405 hartree
zpe.sumelectzpe: -2670.959826 hartree
zpe.sumelectthermal: -2670.934285 hartree
zpe.sumelectthermalent: -2670.933341 hartree
zpe.sumelectthermalfe: -2671.020879 hartree
dipole: 10.5767 3.4828 -3.1926
dipole: 11.5841
quadrupole: -107.1585 -166.3607 -180.6839
quadrupole: 2.0997 5.9562 7.3619
quadrupole: 44.2425 -14.9597 -29.2829 2.0997 5.9562 7.3619
hfenergy: -2671.2222836 hartree
pointgroup: C01 [X(C15H14Cl3N3O2S1)]
dipole: 4.3254095 1.2290803 -0.7424202 debye
polarizability: 596.238383|30.5839719|274.0982919|6.4294415|57.0618233|201.5973557 unknown
InChI: InChI=1S/C9H12N3.C6H2Cl3O2S/c1-12(2)9-5-3-8(4-6-9)7-11-10;7-3-1-5(9)6(12(10)11)2-4(3)8/h3-7,10H,1-2H3;1-2H
charge 0 multiplicity 1
38 atoms
Cl -4.617561 -0.625454 -2.177339
Cl -2.956244 2.895262 2.946912
Cl -4.933521 4.108191 0.615053
S  -2.579357 -1.945597 0.278504
O  -3.732482 -3.037876 -0.086922
O  -1.765597 -2.050206 1.696617
N  6.044973 0.679345 0.186448
N  -1.284498 -1.731968 -1.376439
N  -0.132208 -1.125237 -0.952631
C  4.826793 0.104179 -0.157259
C  -3.305424 -0.181252 0.285324
C  2.300507 -1.085437 -0.857648
C  4.765697 -1.175757 -0.806282
C  3.58355 0.774744 0.121411
C  3.533624 -1.744956 -1.146274
C  2.361583 0.195096 -0.222084
C  -4.142615 0.329238 -0.721682
C  -2.940279 0.594874 1.397129
C  7.305018 -0.021538 -0.108776
C  6.086376 1.991974 0.852062
C  1.045155 -1.72006 -1.186672
C  -3.43258 1.907848 1.512091
C  -4.636238 1.645636 -0.607444
C  -4.279875 2.42912 0.508781
H  5.683601 -1.720494 -1.041415
H  3.584708 1.753644 0.608144
H  3.515775 -2.724972 -1.639593
H  1.420372 0.711643 -0.008946
H  -2.282138 0.156727 2.156256
H  -1.175552 -2.753084 -1.648488
H  7.432961 -0.191003 -1.196185
H  8.152729 0.586359 0.241964
H  7.354147 -1.003251 0.402259
H  5.633941 2.783359 0.222744
H  5.552129 1.973799 1.822124
H  7.13338 2.270141 1.046138
H  1.08836 -2.708477 -1.692816
H  -5.289208 2.05794 -1.380863
