program: Gaussian 09
title: 000256482
version: EM64L-G09RevD.01
frameworkgroup: C1[X(C15H33N)]
method: RPBEPBE
basis: SDD
operation: Freq
keyword: #pfreq=noraman
keyword: PBEPBE/SDD
title: #p freq=noraman PBEPBE/SDD
converged: YES YES NO NO
title: Mulliken charges:
elementType: N C C C C C C C C C C C C C C C H H H H H H H H H H H H H H H H H H H H H H H H H H H H H H H H H
charge: -0.072222 0.527785 -0.487685 -0.511097 -0.457517 -0.457078 -0.399330 -0.413195 -0.400148 -0.401912 -0.349420 -0.699989 -0.700512 -0.702535 -0.618310 -0.629817 0.193237 0.187352 0.215384 0.208053 0.187951 0.192760 0.179787 0.192323 0.200526 0.201515 0.226787 0.189061 0.207965 0.208494 0.218328 0.207851 0.193104 0.194251 0.208766 0.215469 0.208881 0.208074 0.216493 0.207607 0.210032 0.209735 0.215660 0.224393 0.183474 0.220497 0.239735 0.217327 0.182110
chargesum: 0.00000
title: Mulliken charges with hydrogens summed into heavy atoms:
elementType: N C C C C C C C C C C C C C C C
charge: -0.072222 0.527785 -0.107096 -0.087660 -0.076806 -0.084969 0.002712 0.002652 0.016311 0.024267 0.037934 -0.066873 -0.068338 -0.067108 0.010054 0.009357
polarizability: 1.92780099e+02 7.84558813e-01 1.71830752e+02 -2.44242497e-01 -1.17876713e+00 1.48505460e+02
1716.lowfreq: -13.1995 -0.0006 -0.0004 -0.0004 4.7765 7.9058 30.6335 36.7829 43.6432
frequency: 30.4811 36.5220 43.3411 59.4226 62.7014 66.5166 74.5161 84.7480 101.7291 112.0032 125.6010 157.9322 210.1221 214.8765 226.2973 230.2066 234.8634 237.0908 246.1571 250.5271 260.7072 297.0146 313.4408 319.3894 328.5428 340.9231 390.4040 404.0111 442.0031 499.9466 551.3310 560.0935 724.3918 729.7193 742.4242 767.3746 775.3440 787.9885 822.7012 853.6722 855.1701 866.9193 895.6148 917.6588 925.8132 955.1914 973.0608 1017.5128 1031.2642 1034.8779 1040.9510 1043.6777 1052.5321 1065.7137 1079.8577 1081.8615 1091.2431 1098.1868 1101.8073 1116.3775 1130.1931 1153.9368 1172.7069 1180.1049 1198.3318 1220.5718 1235.0804 1238.0454 1253.4481 1260.5315 1271.1094 1279.9431 1286.5067 1293.0855 1296.8654 1298.5444 1304.6341 1319.4860 1326.5089 1338.1727 1354.0028 1355.9601 1359.2488 1380.0335 1388.4270 1388.5823 1389.3766 1417.3775 1441.1897 1459.9862 1461.3295 1463.5735 1465.9247 1468.3932 1472.2876 1473.9117 1474.9948 1476.6339 1477.1222 1477.3568 1477.7692 1478.7585 1479.8571 1483.8816 1487.0888 1488.5245 1490.8484 1492.8494 2824.4104 2835.1969 2854.0822 2955.3854 2956.8719 2959.5601 2962.8536 2969.0320 2969.1553 2970.1595 2971.1916 2973.3959 2979.2861 2983.5565 2991.3939 2996.1550 3000.3714 3005.5275 3012.6314 3014.7430 3025.6920 3029.5420 3031.7235 3035.5094 3039.2020 3066.3993 3067.3910 3067.8338 3068.7992 3069.5529 3069.8683 3074.0310 3087.6997
redmass: 3.2378 2.7671 2.7288 3.3417 1.8738 2.3374 1.6660 1.6760 2.3872 3.0090 2.4059 2.6763 1.6064 2.0651 1.1831 1.4349 1.1311 2.1208 1.3953 1.5534 1.6303 2.4648 3.5771 2.2575 2.0342 2.3876 2.7200 2.8274 2.2075 2.8834 2.3973 2.3894 1.0943 1.0981 1.1813 1.5498 1.9947 1.4644 2.9640 1.6828 1.3902 1.6369 1.7989 1.4243 1.7412 1.9764 1.6347 2.2490 1.5613 2.6096 2.0597 1.7202 2.6808 2.3728 1.8592 2.0115 1.5372 1.9386 1.6987 2.4350 1.3830 1.9834 2.2122 2.6014 2.1971 1.5081 1.3161 1.3649 1.4252 2.3157 1.3385 1.2332 1.1030 1.1527 1.3046 1.2015 1.2531 1.2777 1.3685 1.4744 1.5378 1.5460 1.4849 1.3764 1.2137 1.2181 1.2126 1.1443 1.1696 1.0647 1.0529 1.0701 1.0713 1.0686 1.0627 1.0612 1.0616 1.0443 1.0508 1.0427 1.0486 1.0608 1.0672 1.0657 1.0805 1.0770 1.0779 1.0875 1.0693 1.0578 1.0584 1.0594 1.0588 1.0586 1.0583 1.0519 1.0364 1.0428 1.0374 1.0601 1.0602 1.0602 1.0976 1.0965 1.0966 1.1010 1.0851 1.0715 1.1018 1.0718 1.1016 1.1027 1.1001 1.1008 1.1008 1.1009 1.0993 1.0993 1.0992 1.1009 1.1001
irintensity: 0.0319 0.2333 0.2888 0.0420 0.0067 0.0093 0.0023 0.0107 0.4494 0.2490 0.1965 0.5172 0.0007 0.5284 0.0623 0.1775 0.1083 0.1060 0.0275 0.3472 1.0904 0.0482 0.3037 0.6056 0.0182 8.4484 0.4026 0.7043 1.7548 1.5152 1.8100 2.4974 2.8106 5.5563 20.1041 3.2333 0.7031 0.6357 15.2625 1.6429 0.1813 6.5220 6.0699 8.6393 1.0392 0.2814 2.4341 30.4923 15.0426 3.5499 1.6509 0.6681 0.7709 13.5085 6.1635 8.5940 2.3152 5.8218 4.0018 5.9190 5.6664 5.2461 4.5985 6.1486 6.5704 3.1995 0.2755 1.0364 4.1416 4.5032 3.0207 0.6987 0.4079 0.7766 0.2606 0.2836 4.5635 10.2550 4.3954 5.8302 1.7104 0.6342 0.3612 6.0452 9.0374 10.3734 13.3663 3.4245 2.7016 10.2907 15.3880 0.1143 5.4999 5.1113 2.8216 4.2783 3.4213 6.7111 20.9348 0.4403 19.0308 4.2586 3.5972 6.6352 4.3252 7.0568 63.5827 0.8099 65.7231 70.9149 227.4019 1.4491 11.7921 3.1530 2.6013 3.3705 55.0129 72.6646 52.3334 43.7288 4.6578 103.3989 2.5866 2.4175 35.2127 2.4771 24.6280 46.0684 13.3825 45.5855 52.0774 33.2072 93.0781 33.0251 163.6779 66.6733 55.8598 28.4551 74.3192 38.3521 42.4173
temp: 298.150 k
press: 1.00000 atm
elementType: 7 6 6 6 6 6 6 6 6 6 6 6 6 6 6 6 1 1 1 1 1 1 1 1 1 1 1 1 1 1 1 1 1 1 1 1 1 1 1 1 1 1 1 1 1 1 1 1 1
symmnumber: 1
zpe: 1187076.4 jmol-1
zpe.correction: 0.452134 hartree
zpe.thermalcorrener: 0.474225 hartree
zpe.thermalcorrenthalpy: 0.475169 hartree
zpe.thermalcorrgfe: 0.400170 hartree
zpe.sumelectzpe: -644.750921 hartree
zpe.sumelectthermal: -644.728830 hartree
zpe.sumelectthermalent: -644.727886 hartree
zpe.sumelectthermalfe: -644.802885 hartree
dipole: 0.1558 -0.6674 -0.2998
dipole: 0.7480
quadrupole: -103.6858 -107.2494 -106.7476
quadrupole: -2.0661 -1.3892 -1.8586
quadrupole: 2.2084 -1.3551 -0.8533 -2.0661 -1.3892 -1.8586
hfenergy: -645.2030549 hartree
pointgroup: C01 [X(C15H33N1)]
dipole: 0.0608702 0.2597772 0.1241707 debye
polarizability: 192.7831282|-0.751309|171.8709197|0.2115723|-0.6186221|148.4622636 unknown
InChI: InChI=1S/C15H33N/c1-6-9-12-15(10-7-2,11-8-3)13-14-16(4)5/h6-14H2,1-5H3
charge 0 multiplicity 1
49 atoms
N  3.577181 -0.194932 -0.75351
C  -0.24009 -0.025061 0.199176
C  -1.431559 0.053033 -0.81494
C  1.068875 0.043115 -0.656929
C  -0.30224 1.157526 1.225227
C  -0.306876 -1.347081 1.035446
C  -2.862395 -0.011362 -0.233516
C  2.398151 0.022787 0.125688
C  -0.24472 2.592773 0.652513
C  -0.220999 -2.681402 0.259196
C  -3.94637 0.133159 -1.32763
C  -0.341332 3.663144 1.762417
C  -0.310598 -3.902383 1.202112
C  -5.383243 0.061191 -0.767402
C  4.796546 -0.468587 0.03467
C  3.794705 0.901253 -1.71933
H  -1.317366 -0.764802 -1.556446
H  -1.3331 0.992802 -1.397042
H  1.087398 -0.808714 -1.364229
H  1.018184 0.957896 -1.279189
H  -1.231389 1.055577 1.823568
H  0.529556 1.038825 1.950892
H  0.504906 -1.331558 1.792705
H  -1.249565 -1.341651 1.620876
H  -3.008437 0.78937 0.519848
H  -3.018164 -0.972273 0.297446
H  2.383632 -0.810528 0.853393
H  2.50933 0.970385 0.717299
H  0.698596 2.73792 0.089254
H  -1.068699 2.7475 -0.071883
H  0.728705 -2.730965 -0.308248
H  -1.036679 -2.739879 -0.488114
H  -3.801624 1.097282 -1.85721
H  -3.804194 -0.66181 -2.088486
H  0.487312 3.558694 2.488608
H  -0.297725 4.686042 1.344717
H  -1.290263 3.566789 2.323522
H  0.511845 -3.891423 1.94255
H  -0.247531 -4.853287 0.641511
H  -1.264526 -3.90231 1.763336
H  -5.561095 -0.904179 -0.256609
H  -5.562486 0.86696 -0.030449
H  -6.137648 0.16305 -1.56931
H  4.627216 -1.341293 0.690832
H  5.113938 0.391748 0.679661
H  5.633765 -0.709335 -0.645327
H  2.927102 0.997584 -2.392872
H  4.67936 0.672006 -2.340123
H  3.965409 1.89411 -1.225966
