program: Gaussian 09
title: 000256478
version: EM64L-G09RevD.01
frameworkgroup: C1[X(C11H25N)]
method: RPBEPBE
basis: SDD
operation: Freq
keyword: #pfreq=noraman
keyword: PBEPBE/SDD
title: #p freq=noraman PBEPBE/SDD
converged: YES YES NO NO
title: Mulliken charges:
elementType: N C C C C C C C C C C C H H H H H H H H H H H H H H H H H H H H H H H H H
charge: -0.079224 0.398514 -0.430880 -0.456327 -0.768918 -0.762816 -0.387022 -0.394464 -0.350908 -0.700327 -0.628335 -0.616662 0.188704 0.188288 0.203999 0.220650 0.220323 0.210318 0.204634 0.210203 0.206803 0.219457 0.206514 0.201724 0.189143 0.220654 0.192861 0.193008 0.209732 0.214839 0.210057 0.238092 0.182342 0.217477 0.224140 0.220000 0.183406
chargesum: 0.00000
title: Mulliken charges with hydrogens summed into heavy atoms:
elementType: N C C C C C C C C C C C
charge: -0.079224 0.398514 -0.053888 -0.031678 -0.133643 -0.126352 0.021217 0.015334 0.034961 -0.065699 0.009575 0.010884
polarizability: 1.47229083e+02 -3.23789982e-01 1.23180548e+02 -1.02513685e+00 5.68431348e-01 1.12630374e+02
1716.lowfreq: -7.7433 -0.0005 -0.0002 0.0002 8.0809 15.1692 30.3359 43.0134 56.0085
frequency: 29.9616 42.9742 55.9864 63.5080 96.4672 114.2755 139.0216 162.5382 225.3748 226.6841 231.2260 238.5947 247.4794 260.8307 271.2109 290.3583 315.0369 339.4201 365.9534 392.2708 433.2228 456.6700 488.7497 530.8596 727.6903 746.1585 775.4090 784.6891 819.2170 893.3854 903.9347 908.7015 928.4773 964.0716 973.4267 1011.9295 1021.2086 1032.5028 1039.2385 1061.6828 1079.4647 1087.2457 1097.1589 1101.8773 1128.1732 1157.8232 1180.0611 1203.8962 1218.9825 1240.9440 1254.7910 1262.5109 1274.8460 1288.8922 1302.3265 1313.6316 1318.6976 1333.3789 1355.3905 1374.7156 1376.6652 1388.6198 1392.8714 1417.1683 1440.8268 1452.2225 1455.2759 1460.5288 1465.4552 1467.5618 1469.9922 1473.9969 1475.6158 1477.1908 1477.5960 1480.3979 1485.9628 1487.6549 1489.0337 1493.0671 2832.2144 2835.7463 2854.9024 2941.2092 2961.0022 2964.1693 2965.7179 2971.0187 2972.2820 2974.5717 2989.8106 3004.3431 3014.3840 3015.3463 3028.0917 3037.9297 3040.8772 3055.7854 3061.8162 3068.0512 3069.5639 3069.8314 3072.7985 3074.1294 3086.4649
redmass: 2.1174 2.0126 2.5702 2.5728 2.6566 1.9471 2.7916 2.0685 1.6456 1.3467 1.1102 1.2210 1.2010 1.8557 1.2822 2.6254 2.2073 2.1696 2.3569 2.4171 2.1012 2.5078 2.6579 2.7499 1.0877 3.1806 1.2119 1.3480 3.4684 1.8847 1.8515 1.4860 1.4630 1.5450 1.4887 1.8614 1.7872 1.7003 2.5817 1.8807 2.2426 1.3268 1.7591 2.0546 1.4303 1.9090 2.1161 1.7106 2.4773 1.7426 1.7859 1.7848 1.5392 1.1351 1.2963 1.3682 1.3345 1.4588 1.5497 1.2351 1.3382 1.2153 1.2075 1.1441 1.1631 1.0771 1.0728 1.0514 1.0682 1.0521 1.0575 1.0589 1.0697 1.0496 1.0433 1.0796 1.0703 1.0645 1.0645 1.0610 1.0674 1.0587 1.0595 1.0587 1.0580 1.0487 1.0453 1.0387 1.0467 1.0483 1.0987 1.1008 1.0779 1.0786 1.0717 1.1028 1.1009 1.0992 1.0985 1.1007 1.0991 1.0989 1.0983 1.1007 1.1000
irintensity: 0.2912 0.2604 0.0444 0.1711 0.0847 0.3297 0.1510 0.5455 0.3457 0.2780 0.0789 0.1614 0.3443 1.4273 0.0510 0.0114 0.5652 7.8410 1.0726 0.2681 0.2206 0.8469 3.1624 1.7511 9.3397 0.6200 0.6606 0.6164 17.6485 10.3398 4.5684 1.1968 0.7151 0.7327 2.3789 21.0434 6.9379 21.8803 5.6152 9.0438 1.6560 4.4630 7.8110 3.5072 8.3270 6.9167 5.1296 1.1878 15.5363 5.5671 0.8071 4.2312 3.2215 0.4021 3.6751 24.1335 0.8838 3.9595 1.2897 22.9853 8.8102 13.1102 13.7181 2.7997 2.5600 0.7635 3.1031 19.6811 0.1359 3.2378 8.5180 3.3801 3.2473 10.8010 12.2860 12.6852 13.9090 6.8509 14.3781 21.6329 55.9629 71.2959 240.4612 26.4488 16.8920 34.5129 37.5208 25.6295 52.0936 37.8767 13.6675 0.0355 27.6562 35.0933 40.7291 75.0507 19.8935 44.4532 38.1928 105.3343 8.3676 100.7270 52.3008 44.4048 43.0754
temp: 298.150 k
press: 1.00000 atm
elementType: 7 6 6 6 6 6 6 6 6 6 6 6 1 1 1 1 1 1 1 1 1 1 1 1 1 1 1 1 1 1 1 1 1 1 1 1 1
symmnumber: 1
zpe: 892862.6 jmol-1
zpe.correction: 0.340073 hartree
zpe.thermalcorrener: 0.356645 hartree
zpe.thermalcorrenthalpy: 0.357589 hartree
zpe.thermalcorrgfe: 0.295705 hartree
zpe.sumelectzpe: -487.863604 hartree
zpe.sumelectthermal: -487.847033 hartree
zpe.sumelectthermalent: -487.846088 hartree
zpe.sumelectthermalfe: -487.907973 hartree
dipole: -0.3159 0.4422 -0.5973
dipole: 0.8075
quadrupole: -76.8208 -80.5042 -80.1476
quadrupole: 0.4158 0.7158 2.3423
quadrupole: 2.3368 -1.3467 -0.9901 0.4158 0.7158 2.3423
hfenergy: -488.2036775 hartree
pointgroup: C01 [X(C11H25N1)]
dipole: -0.1210812 0.1914747 -0.222733 debye
polarizability: 147.2217643|-0.5955252|123.0642707|-0.9469365|1.3011824|112.7539704 unknown
InChI: InChI=1S/C11H25N/c1-6-7-8-11(2,3)9-10-12(4)5/h6-10H2,1-5H3
charge 0 multiplicity 1
37 atoms
N  -2.958879 -0.915201 0.185071
C  0.333005 1.221314 0.00218
C  1.754213 0.805288 -0.505207
C  -0.652871 0.026905 -0.207714
C  0.402616 1.627807 1.499864
C  -0.116924 2.451483 -0.834588
C  2.424778 -0.399589 0.193906
C  -2.137312 0.320824 0.098882
C  3.832612 -0.700473 -0.372569
C  4.513028 -1.904543 0.31369
C  -3.047198 -1.64851 -1.094212
C  -4.299265 -0.637594 0.740913
H  1.684803 0.589755 -1.593297
H  2.425022 1.685708 -0.406076
H  -0.54842 -0.316561 -1.257439
H  -0.350222 -0.817305 0.441374
H  0.612657 0.758268 2.148975
H  1.201902 2.376167 1.661913
H  -0.546961 2.079339 1.841902
H  -0.212872 2.190697 -1.906248
H  0.624086 3.269573 -0.750185
H  -1.090541 2.846104 -0.491704
H  1.796312 -1.30566 0.083675
H  2.5119 -0.207222 1.282216
H  -2.55554 1.027756 -0.664952
H  -2.213721 0.824703 1.081153
H  3.753639 -0.890367 -1.462897
H  4.470807 0.200221 -0.260769
H  4.632298 -1.726199 1.399203
H  5.515951 -2.099729 -0.108991
H  3.909385 -2.823721 0.190684
H  -2.044728 -1.967037 -1.42546
H  -3.509643 -1.043084 -1.91747
H  -3.659719 -2.557249 -0.953757
H  -4.199433 -0.16366 1.734005
H  -4.853406 -1.58509 0.868992
H  -4.919558 0.038683 0.096636
