program: Gaussian 09
title: 000256470
version: EM64L-G09RevD.01
frameworkgroup: C1[X(C18H20N6)]
method: RPBEPBE
basis: SDD
operation: Freq
keyword: #pfreq=noraman
keyword: PBEPBE/SDD
title: #p freq=noraman PBEPBE/SDD
converged: YES YES NO NO
title: Mulliken charges:
elementType: N N N N N N C C C C C C C C C C C C C C C C C C H H H H H H H H H H H H H H H H H H H H
charge: -0.392450 -0.392447 -0.403600 -0.403599 -0.064590 -0.064589 -0.265836 -0.265844 0.025462 0.025462 0.468608 0.468621 -0.436101 -0.436100 -0.414709 -0.414709 0.224857 0.224856 -0.439928 -0.399258 -0.399264 -0.439941 -0.270197 -0.270197 0.209634 0.209635 0.202799 0.235402 0.202799 0.235401 0.193187 0.213617 0.193187 0.213618 0.271068 0.271068 0.227075 0.261776 0.261779 0.227074 0.297353 0.297353 0.255835 0.255835
chargesum: 0.00000
title: Mulliken charges with hydrogens summed into heavy atoms:
elementType: N N N N N N C C C C C C C C C C C C C C C C C C
charge: -0.121382 -0.121380 -0.106246 -0.106246 -0.064590 -0.064589 -0.056202 -0.056209 0.025462 0.025462 0.468608 0.468621 0.002100 0.002100 -0.007905 -0.007905 0.224857 0.224856 -0.212853 -0.137482 -0.137485 -0.212867 -0.014361 -0.014362
polarizability: 2.96660795e+02 -2.02972552e-04 2.05563342e+02 2.56686889e+01 -1.09635922e-03 1.77043001e+02
1716.lowfreq: -4.3477 -1.2573 -0.0001 0.0004 0.0005 8.8149 13.8819 24.8193 29.8161
frequency: 13.8788 24.8134 29.7952 46.2093 65.2626 67.4526 131.7613 139.3046 181.8291 203.9776 207.4156 223.8082 238.4646 311.5289 312.9001 331.5618 332.1654 350.7903 386.9705 408.9757 422.0157 457.5446 467.8815 489.2624 505.2054 534.2525 600.0939 605.3646 611.1638 612.9996 625.0081 633.9423 642.1644 644.3946 666.3930 675.0011 699.2435 711.5358 732.0313 762.7204 763.2887 790.4604 809.3107 819.9392 844.9423 858.1530 866.1262 900.8637 906.3380 907.6366 910.7900 931.3520 931.9685 972.4677 985.7195 1004.1123 1005.3488 1015.1841 1051.8750 1052.2738 1082.5622 1082.7184 1106.2624 1124.6009 1126.8860 1140.9284 1142.1146 1175.4790 1177.8324 1178.2206 1201.4761 1206.5901 1213.6689 1213.7846 1228.9029 1229.7385 1250.3927 1250.6141 1282.2426 1283.1515 1285.9219 1291.3310 1304.9895 1305.6169 1328.4368 1344.8109 1346.9922 1366.1107 1367.8612 1391.6794 1399.9297 1400.3099 1410.4799 1438.0109 1438.0223 1450.7081 1450.7452 1465.9596 1466.0810 1474.9007 1475.2099 1500.1921 1589.6450 1594.7646 1594.8283 1621.9263 2842.7884 2842.8245 2871.5134 2871.8246 2972.0200 2972.1078 3025.5622 3025.6105 3045.3770 3045.4229 3120.1510 3121.0230 3151.7460 3155.5416 3236.6894 3236.7100 3487.8474 3487.8778 3584.5893 3584.6222
redmass: 4.8981 5.9905 3.8574 4.2889 4.2751 5.7128 4.9851 3.6529 4.4000 4.0036 4.2870 3.7774 4.3052 2.5321 2.2962 4.3903 3.2126 5.4912 4.3453 2.9055 4.8481 3.9206 3.0188 2.1562 2.5766 3.0580 2.1277 3.1285 2.2932 2.0194 3.0689 4.3501 1.3670 1.5620 4.4559 3.9837 3.2690 3.4170 3.8248 1.4365 1.4508 2.5512 3.7257 3.7874 3.1300 1.2539 2.5372 2.6130 3.0870 2.9399 2.4587 4.0689 4.0530 1.4023 1.3750 2.3688 2.3960 2.7738 1.9120 1.9155 1.7407 1.7244 1.4102 3.0894 2.8703 5.1176 4.3944 1.1746 1.3081 1.2586 1.7876 2.6466 1.3488 1.3728 1.3944 1.3795 1.6504 1.6511 1.5967 1.8986 1.9751 1.9836 1.9457 2.0048 1.3652 1.8016 1.7452 1.5441 1.4793 5.2654 4.6112 4.6387 2.4622 1.6322 1.6223 1.1718 1.1696 1.7133 1.6906 1.2969 1.3163 2.6924 6.9761 6.5296 6.5053 6.4837 1.0805 1.0803 1.0714 1.0714 1.0585 1.0585 1.1014 1.1014 1.0908 1.0907 1.0888 1.0885 1.0941 1.0952 1.0982 1.0982 1.0757 1.0757 1.0818 1.0818
irintensity: 1.2889 1.2862 0.6590 7.2993 0.0359 0.0325 0.0004 0.9666 0.9415 11.6821 0.1324 2.8011 19.1118 0.5796 1.8817 9.9338 0.0016 2.2395 4.1359 0.0213 4.3530 0.8092 59.2404 1.4864 46.8597 8.3495 94.6195 2.4275 108.0509 30.0511 0.0615 0.2348 113.9172 3.7785 12.2070 1.0600 11.4112 0.0602 12.9460 64.2707 6.1603 38.0525 6.6089 19.3128 4.4784 0.9295 19.5707 0.8171 0.1157 31.9597 0.8112 7.6242 0.9717 0.0185 1.5126 0.4736 10.0736 15.8754 5.0363 2.0308 14.4620 8.0904 10.1328 6.3785 7.8020 0.2195 68.5365 0.6241 4.9146 0.1733 6.2790 0.5387 9.3653 0.2793 7.6769 7.6430 0.0999 17.6987 0.4685 47.8958 1.2562 30.7436 47.2574 6.5506 0.0000 56.2815 0.2518 3.1201 0.3097 0.8624 38.5795 1.1948 12.4802 1.6650 23.6026 1.1468 17.0768 1.0708 4.2590 11.4023 0.7125 31.3732 1.2912 6.0078 19.0963 0.7721 15.2160 102.8314 249.9975 38.8820 122.1213 0.6281 78.9659 0.8995 68.3990 42.9523 27.9232 0.1175 16.2894 0.0955 1.8503 4.2837 0.3074 0.1016 39.9013 25.7354
temp: 298.150 k
press: 1.00000 atm
elementType: 7 7 7 7 7 7 6 6 6 6 6 6 6 6 6 6 6 6 6 6 6 6 6 6 1 1 1 1 1 1 1 1 1 1 1 1 1 1 1 1 1 1 1 1
symmnumber: 1
zpe: 944575.6 jmol-1
zpe.correction: 0.359770 hartree
zpe.thermalcorrener: 0.379255 hartree
zpe.thermalcorrenthalpy: 0.380199 hartree
zpe.thermalcorrgfe: 0.309332 hartree
zpe.sumelectzpe: -1024.679811 hartree
zpe.sumelectthermal: -1024.660326 hartree
zpe.sumelectthermalent: -1024.659382 hartree
zpe.sumelectthermalfe: -1024.730249 hartree
dipole: 0.0000 0.3028 0.0000
dipole: 0.3028
quadrupole: -76.2191 -118.2199 -143.9030
quadrupole: -0.0001 11.9251 0.0000
quadrupole: 36.5615 -5.4393 -31.1223 -0.0001 11.9251 0.0000
hfenergy: -1025.0395811 hartree
pointgroup: C01 [X(C18H20N6)]
dipole: -0.0000074 0.1191367 0.0000238 debye
polarizability: 298.1171417|-0.0055526|205.5633419|21.9671476|0.0043631|175.5866548 unknown
InChI: InChI=1S/C18H20N6/c1-2-12(16-18-14(6-8-20-16)22-10-24-18)4-3-11(1)15-17-13(5-7-19-15)21-9-23-17/h1-4,9-10,15-16,19-22H,5-8H2
charge 0 multiplicity 1
44 atoms
N  -3.66297 -1.778476 -0.360566
N  3.662877 -1.778789 0.360067
N  -4.832009 2.108094 0.287181
N  4.832163 2.107865 -0.286727
N  -2.938057 1.493411 1.368203
N  2.938168 1.493569 -1.367893
C  -2.888017 -1.003123 0.647164
C  2.887978 -1.003143 -0.64748
C  -3.47311 0.395206 0.675516
C  3.473158 0.395157 -0.675485
C  -1.393117 -1.020007 0.305634
C  1.393077 -1.020019 -0.305958
C  -5.520119 -0.186931 -0.779297
C  5.520134 -0.187468 0.779178
C  -5.131474 -1.623501 -0.32883
C  5.131392 -1.623905 0.328367
C  -4.646386 0.745757 0.008203
C  4.646458 0.745469 -0.008089
C  -0.426945 -1.02029 1.339827
C  0.951725 -1.015731 1.039268
C  -0.951765 -1.015507 -1.03959
C  0.426906 -1.020078 -1.34015
C  -3.778237 2.513152 1.109986
C  3.778411 2.513194 -1.109424
H  -2.995528 -1.43305 1.675565
H  2.995468 -1.432825 -1.675985
H  -6.598209 -0.013444 -0.588829
H  -5.344988 -0.084217 -1.867906
H  6.598235 -0.014008 0.588745
H  5.345017 -0.085006 1.867813
H  -5.56851 -1.801243 0.685074
H  -5.572144 -2.365108 -1.019416
H  5.568414 -1.801433 -0.685581
H  5.572014 -2.365706 1.018774
H  -3.350865 -2.753923 -0.415236
H  3.350707 -2.754228 0.414503
H  -0.758004 -1.008016 2.385618
H  1.702539 -1.016496 1.836136
H  -1.702579 -1.016095 -1.836458
H  0.757966 -1.00764 -2.385939
H  -5.594848 2.693297 -0.050971
H  5.595039 2.692937 0.051569
H  -3.671015 3.53008 1.479803
H  3.671248 3.530221 -1.478985
