program: Gaussian 09
title: 000264512
version: EM64L-G09RevD.01
frameworkgroup: C1[X(C14H14N2O5S)]
method: RPBEPBE
basis: SDD
operation: Freq
keyword: #p
keyword: freq=noraman
keyword: PBEPBE/SDD
title: #p freq=noraman PBEPBE/SDD
converged: YES YES NO NO
title: Mulliken charges:
elementType: S O O O O O N N C C C C C C C C C C C C C C H H H H H H H H H H H H H H
charge: 0.917131 -0.268168 -0.526442 -0.515766 -0.213605 -0.216970 -0.539091 0.017779 -0.063564 0.255342 0.235486 -0.229217 -0.233743 -0.439538 0.450814 -0.389683 -0.336883 0.411421 -0.284603 -0.387832 -0.797983 -0.526696 0.323336 0.280954 0.291781 0.312858 0.245370 0.248502 0.253758 0.287378 0.240248 0.228411 0.241047 0.239200 0.230667 0.258301
chargesum: 0.00000
title: Mulliken charges with hydrogens summed into heavy atoms:
elementType: S O O O O O N N C C C C C C C C C C C C C C
charge: 0.917131 -0.268168 -0.526442 -0.515766 -0.213605 -0.216970 -0.215754 0.017779 -0.063564 0.255342 0.235486 0.051736 0.058038 -0.126680 0.450814 -0.144313 -0.088381 0.411421 -0.030845 -0.100454 -0.088277 0.201471
polarizability: 3.05614228e+02 -1.07357520e+01 2.69400143e+02 1.56148832e+01 1.61606740e+01 1.30621695e+02
1716.lowfreq: -16.3777 -11.5811 -4.7784 -0.0021 -0.0017 -0.0015 1.9893 8.4410 18.6292
frequency: -15.5759 4.9582 18.5227 35.2748 52.3139 59.7700 62.5307 84.2382 121.3100 130.8765 138.6311 154.3310 174.9264 194.7611 215.1231 222.6266 243.2664 279.1932 287.3583 303.4739 328.9563 350.7038 374.6016 387.4954 391.4143 406.5492 433.9350 463.6737 484.8282 509.8362 537.4160 566.2885 574.6667 586.4048 614.5761 620.3155 698.4910 706.7840 732.7713 745.7109 758.2053 776.8890 805.6047 820.9093 829.1795 852.0009 892.4538 929.8806 938.8485 952.7950 965.5164 966.4387 980.6620 985.3943 989.9227 995.9632 1050.6606 1051.9164 1073.8328 1113.8584 1121.2783 1129.6405 1154.4586 1186.5075 1200.5639 1207.2713 1219.6383 1237.7463 1256.9670 1289.4101 1298.0362 1359.2601 1380.0405 1392.7206 1399.6604 1409.3294 1433.1197 1440.6149 1467.4854 1469.5466 1470.7596 1471.5837 1474.4197 1479.9924 1581.1629 1593.2103 1594.6094 1599.7680 2980.8187 2983.3259 3063.9668 3078.9341 3093.3373 3139.2996 3140.9002 3143.8318 3163.5970 3165.6430 3167.2329 3188.0719 3189.9597 3340.2864
redmass: 1.0466 5.6377 5.4794 4.3327 9.8124 5.8534 6.8591 4.6695 4.9595 5.0706 5.1850 7.6129 6.4856 6.6749 1.2136 6.4227 4.8265 5.5990 5.1768 4.8233 6.7540 5.2808 3.8052 6.7907 6.8570 2.8721 5.9506 5.2359 4.3749 3.2210 6.2013 5.7845 3.7952 5.7577 7.5858 6.9610 6.0052 3.2912 5.4465 5.4596 6.1304 5.0490 11.5949 1.5631 1.3568 1.2525 1.7969 4.4357 1.8895 2.5859 1.3189 1.3525 7.8770 1.5968 1.5402 3.0288 1.6176 2.4243 2.0281 1.2571 1.2921 1.6442 1.4491 1.1490 1.7670 4.3022 3.0306 3.0732 2.3465 1.4397 1.2633 10.8905 4.6549 2.9622 1.3099 6.8178 1.4681 2.3512 1.2371 1.0562 1.0517 2.2396 1.1183 2.0477 8.0288 6.8855 5.9376 6.6751 1.0320 1.0378 1.0968 1.1051 1.0993 1.0891 1.0893 1.1011 1.0957 1.0888 1.0969 1.0933 1.0950 1.0737
irintensity: 0.4886 4.0794 3.5514 0.0479 0.4948 0.2371 0.3902 0.2317 0.9705 6.8332 3.3697 2.0731 2.9225 14.8955 0.6893 6.4015 3.5125 10.8353 7.0665 2.0526 1.7057 3.1220 2.5108 10.9443 36.6574 0.7927 92.1158 8.4477 3.6040 71.4329 6.5893 0.9511 12.0466 33.3092 17.7641 0.2359 18.6898 0.3506 2.9599 10.5642 11.3601 6.1172 93.8142 38.1232 30.9367 3.9131 118.4546 52.2504 11.5138 16.2678 0.1221 1.6950 59.5646 0.9563 1.1149 5.1234 22.9711 21.2339 39.3449 0.4929 7.4061 81.3129 3.7583 13.5036 11.1221 245.8344 13.7449 281.2167 98.6907 29.1022 2.7892 80.3686 2.5977 10.4417 16.6094 60.9935 11.5260 13.8664 97.6384 14.2100 17.0091 20.0515 16.6372 25.3874 12.5160 0.7850 17.6110 111.5527 63.9778 21.1165 14.0899 28.7203 17.0619 9.6436 7.8783 11.2690 0.8734 9.9909 8.0942 0.5324 6.1206 38.3420
temp: 298.150 k
press: 1.00000 atm
elementType: 16 8 8 8 8 8 7 7 6 6 6 6 6 6 6 6 6 6 6 6 6 6 1 1 1 1 1 1 1 1 1 1 1 1 1 1
symmnumber: 1
zpe: 682995.0 jmol-1
zpe.correction: 0.260139 hartree
zpe.thermalcorrener: 0.281323 hartree
zpe.thermalcorrenthalpy: 0.282267 hartree
zpe.thermalcorrgfe: 0.206209 hartree
zpe.sumelectzpe: -1423.710090 hartree
zpe.sumelectthermal: -1423.688906 hartree
zpe.sumelectthermalent: -1423.687961 hartree
zpe.sumelectthermalfe: -1423.764019 hartree
dipole: 1.5496 -1.3348 -1.9895
dipole: 2.8533
quadrupole: -82.6694 -164.5618 -140.1459
quadrupole: -20.9180 2.3435 7.1681
quadrupole: 46.4563 -35.4361 -11.0202 -20.9180 2.3435 7.1681
hfenergy: -1423.9702286 hartree
pointgroup: C01 [X(C14H14N2O5S1)]
dipole: 0.0068808 -0.4187025 -1.041538 debye
polarizability: 285.1838901|-8.7232314|260.8545312|-28.7983072|61.7324746|159.5976446 unknown
InChI: InChI=1S/C14H14N2O5S/c1-10-3-6-12(7-4-10)22(19,20)15-13-9-11(16(17)18)5-8-14(13)21-2/h3-9,15H,1-2H3
charge 0 multiplicity 1
36 atoms
S  -1.65836 -1.595447 -0.033047
O  1.177843 -2.804906 -2.52087
O  -2.821785 -2.636086 -0.495392
O  -0.517703 -1.993616 1.063059
O  3.839457 2.588404 -0.360064
O  1.621078 3.019518 -0.036892
N  -0.802492 -1.059268 -1.770463
N  2.590605 2.258748 -0.431645
C  -2.436605 0.017361 0.520719
C  0.556792 -0.69078 -1.638024
C  1.616607 -1.584635 -2.027498
C  -3.676566 0.381383 -0.025922
C  -1.749105 0.789252 1.472569
C  0.895549 0.579361 -1.123838
C  -3.594994 2.422682 1.360076
C  -4.250521 1.596804 0.408814
C  -2.342891 2.000755 1.883751
C  2.252232 0.93563 -0.991712
C  2.972462 -1.195376 -1.912368
C  3.296453 0.067862 -1.384667
C  -4.22043 3.724289 1.824846
C  2.17603 -3.820516 -2.889095
H  -0.907135 -1.95372 -2.29348
H  -4.17933 -0.264796 -0.752114
H  -0.795059 0.444651 1.883996
H  0.113109 1.287853 -0.840736
H  -5.218983 1.906547 0.000612
H  -1.823883 2.627069 2.618025
H  3.776065 -1.872847 -2.213148
H  4.333842 0.391962 -1.270898
H  -3.502154 4.561016 1.753595
H  -5.109838 3.986258 1.227609
H  -4.534948 3.655707 2.883478
H  2.803634 -4.08339 -2.018128
H  2.806282 -3.465651 -3.725444
H  1.588142 -4.693181 -3.205005
