program: Gaussian 09
title: 000256465
version: EM64L-G09RevD.01
frameworkgroup: C1[X(C15H14Cl2N4S)]
method: RPBEPBE
basis: SDD
operation: Freq
keyword: #p
keyword: freq=noraman
keyword: PBEPBE/SDD
title: #p freq=noraman PBEPBE/SDD
converged: YES YES NO NO
title: Mulliken charges:
elementType: Cl Cl S N N N N C C C C C C C C C C C C C C C H H H H H H H H H H H H H H
charge: -0.042377 -0.040981 0.301653 -0.161990 -0.000675 0.030049 -0.010552 -0.392682 -0.393145 0.451122 -0.366713 -0.343224 -0.584644 -0.584245 0.471349 -0.396682 -0.402558 -0.384109 -0.224736 -0.288215 -0.188065 -0.089490 0.253985 0.254739 0.255427 0.254057 0.239271 0.239606 0.292577 0.271805 0.293333 0.270748 0.233200 0.277730 0.232645 0.271789
chargesum: 0.00000
title: Mulliken charges with hydrogens summed into heavy atoms:
elementType: Cl Cl S N N N N C C C C C C C C C C C C C C C
charge: -0.042377 -0.040981 0.301653 -0.161990 -0.000675 0.030049 -0.010552 0.116042 0.116339 0.451122 -0.127442 -0.103618 -0.020262 -0.020164 0.471349 -0.163482 -0.124828 -0.151464 -0.224736 -0.016426 -0.188065 -0.089490
polarizability: 6.33885070e+02 1.11065718e+01 2.01245045e+02 -8.32026417e+00 -3.16238677e+01 1.33224384e+02
1716.lowfreq: -4.5464 -2.3290 -0.0017 -0.0011 0.0010 3.0794 17.4185 24.6805 27.1493
frequency: 17.3635 24.6352 27.0904 30.8328 45.0852 53.4268 64.1705 81.8930 106.4157 116.9194 123.9933 153.2448 160.0452 199.2279 208.7301 210.9959 243.1951 243.3725 292.7018 297.7795 351.4935 387.5028 391.1570 426.2683 433.9907 458.2499 482.4795 506.9891 521.2330 540.7920 568.2791 579.0348 615.9264 630.5895 632.3298 666.1136 692.2215 706.5993 723.2257 740.0266 760.1290 784.4194 791.7412 810.2475 811.5479 834.4291 854.3623 944.2990 949.0681 978.5621 990.5247 993.8622 998.7200 1016.4336 1034.7726 1035.6244 1042.3479 1112.0753 1117.3515 1141.2513 1184.9527 1200.2667 1218.4919 1218.5512 1255.4830 1256.6232 1259.5294 1273.8040 1278.2583 1291.4599 1319.8288 1349.9044 1352.9236 1354.1772 1380.1700 1394.5471 1430.8730 1448.7892 1460.7944 1461.3339 1469.9315 1487.7677 1507.7390 1525.6164 1549.3059 1583.2409 1630.6490 2171.4759 2971.1342 3020.3574 3024.9214 3062.9479 3063.3856 3076.0269 3081.2524 3123.2700 3146.2233 3146.8674 3149.7821 3165.1829 3170.8126 3194.4318
redmass: 10.1681 11.8031 11.4612 13.2216 11.1002 7.7843 3.8535 4.6268 3.1235 7.2168 2.9160 7.6960 9.0295 4.8569 5.8521 4.9176 5.2629 5.4074 5.2971 3.6228 5.8192 4.6180 3.3584 3.2013 7.9215 10.4524 8.5941 4.8636 2.8894 4.5060 5.6287 6.6830 4.9459 8.6266 7.7337 7.5225 6.1083 5.4128 6.0428 3.7708 5.8744 1.1285 1.1724 1.3928 1.4130 1.5482 4.4756 1.4274 2.6580 1.5138 1.4030 2.8762 1.4446 5.8389 1.8999 4.4107 2.3375 3.3884 1.8419 1.5108 1.5915 1.1816 1.9902 1.9104 2.0097 1.4303 1.1695 1.9207 1.3207 1.1762 1.5332 1.6989 1.4934 1.3813 3.5328 1.8884 7.3130 3.4601 1.1121 1.1210 3.8818 1.1063 1.1366 3.0624 7.2349 5.8844 6.5601 12.6105 1.0872 1.0602 1.0609 1.0569 1.0571 1.1043 1.1043 1.0895 1.1114 1.1111 1.0885 1.0935 1.0961 1.0947
irintensity: 1.1195 1.3803 0.3589 0.6408 0.0403 0.4920 0.4007 2.2504 0.4991 2.0461 1.4543 0.1734 0.3391 6.7300 9.0734 0.7125 2.6070 10.8408 1.6877 1.3412 5.3893 17.8426 4.5227 2.9027 2.9709 4.8229 10.2417 4.4670 19.8860 12.0421 14.7010 13.6774 8.3199 1.0343 3.7987 99.9324 23.3012 72.3476 13.2924 8.2907 3.6708 2.7794 11.3797 8.5681 32.6588 51.2140 15.8581 3.1473 61.0358 20.0270 8.2057 1.1753 4.4132 68.5400 0.3023 0.6386 0.0466 173.4119 73.5010 32.6759 166.6792 127.4327 24.9248 7.3369 4.0100 29.1643 25.7576 9.3909 93.9849 5.7949 51.6347 6.0170 194.2938 26.2484 1.1766 259.2384 154.2763 53.0796 7.4886 18.3273 11.5814 27.9562 5.6347 623.8937 290.2833 855.8320 333.8934 107.9608 36.9714 19.2843 30.5705 5.4322 26.0304 6.7795 5.6323 8.8360 3.4263 22.6864 4.9199 22.4060 20.6474 7.2326
temp: 298.150 k
press: 1.00000 atm
elementType: 17 17 16 7 7 7 7 6 6 6 6 6 6 6 6 6 6 6 6 6 6 6 1 1 1 1 1 1 1 1 1 1 1 1 1 1
symmnumber: 1
zpe: 690666.8 jmol-1
zpe.correction: 0.263061 hartree
zpe.thermalcorrener: 0.284823 hartree
zpe.thermalcorrenthalpy: 0.285768 hartree
zpe.thermalcorrgfe: 0.207097 hartree
zpe.sumelectzpe: -2115.555291 hartree
zpe.sumelectthermal: -2115.533528 hartree
zpe.sumelectthermalent: -2115.532584 hartree
zpe.sumelectthermalfe: -2115.611255 hartree
dipole: -10.0922 -1.3737 0.5494
dipole: 10.2000
quadrupole: -238.0693 -158.8275 -149.6930
quadrupole: -3.8324 0.7299 -2.1196
quadrupole: -55.8727 23.3691 32.5036 -3.8324 0.7299 -2.1196
hfenergy: -2115.8183517 hartree
pointgroup: C01 [X(C15H14Cl2N4S1)]
dipole: 3.9349363 0.6756013 0.4050521 debye
polarizability: 631.3576867|32.081472|182.4940613|15.0266094|45.5309763|154.5027515 unknown
InChI: InChI=1S/C15H14Cl2N4S/c16-5-7-21(8-6-17)13-3-1-12(2-4-13)10-19-15-11-20-14(9-18)22-15/h1-4,10-11H,5-8H2
charge 0 multiplicity 1
36 atoms
Cl 6.463361 3.393733 0.563923
Cl 5.705002 -3.750273 -0.954337
S  -4.875327 -0.812193 -1.257586
N  4.165059 -0.002557 -0.063467
N  -2.376152 -0.320953 -0.173597
N  -5.83764 -0.031226 1.127085
N  -8.719711 -0.813648 -0.83579
C  5.080556 0.961926 0.578471
C  4.78697 -1.112234 -0.813917
C  2.77142 0.12911 0.037762
C  2.177008 1.237835 0.724518
C  1.889157 -0.844098 -0.544361
C  5.310184 2.191377 -0.321376
C  4.912714 -2.373251 0.062445
C  -0.087873 0.390432 0.24549
C  0.784326 1.355781 0.824263
C  0.501599 -0.71119 -0.4429
C  -1.528992 0.5401 0.363993
C  -3.730143 -0.263703 0.048923
C  -4.464629 0.077764 1.204289
C  -6.241575 -0.462274 -0.071084
C  -7.589182 -0.647673 -0.475385
H  4.691488 1.278882 1.561638
H  6.048711 0.466454 0.767722
H  4.211992 -1.341463 -1.727603
H  5.792872 -0.800754 -1.145356
H  2.799611 2.013869 1.177832
H  2.290853 -1.711444 -1.075675
H  4.383518 2.748441 -0.51992
H  5.810522 1.930527 -1.265772
H  3.936897 -2.759153 0.390206
H  5.573668 -2.216103 0.927766
H  0.359301 2.216457 1.355867
H  -0.16295 -1.457233 -0.890527
H  -1.891053 1.431159 0.917298
H  -4.007665 0.371578 2.150459
