program: Gaussian 09
title: 000256461
version: EM64L-G09RevD.01
frameworkgroup: C1[X(C17H14N2O2)]
method: RPBEPBE
basis: SDD
operation: Freq
keyword: #p
keyword: freq=noraman
keyword: PBEPBE/SDD
title: #p freq=noraman PBEPBE/SDD
converged: YES YES NO NO
title: Mulliken charges:
elementType: O O N N C C C C C C C C C C C C C C C C C H H H H H H H H H H H H H H
charge: -0.213350 -0.227622 -0.429962 -0.398212 0.014202 0.503620 0.261056 0.185367 -0.701759 -0.555438 0.181713 0.280685 0.184440 -0.697379 -0.431901 -0.402278 0.158971 -0.395866 -0.424372 -0.235603 -0.235715 0.245899 0.251784 0.263685 0.329120 0.247023 0.236183 0.230182 0.248851 0.241207 0.350426 0.239047 0.242423 0.226928 0.226644
chargesum: 0.00000
title: Mulliken charges with hydrogens summed into heavy atoms:
elementType: O O N N C C C C C C C C C C C C C C C C C
charge: -0.213350 -0.227622 -0.100842 -0.047786 0.014202 0.503620 0.261056 0.185367 -0.204076 -0.291754 0.181713 0.280685 0.184440 0.016010 -0.183049 -0.161070 0.158971 -0.156819 -0.181950 -0.008676 -0.009071
polarizability: 3.19764646e+02 9.84929036e+00 1.96664876e+02 5.93734032e+00 1.82081540e+00 1.11169433e+02
1716.lowfreq: -9.2242 -3.2913 -0.0009 -0.0006 -0.0004 10.9565 24.2141 36.7933 56.9955
frequency: 24.0396 36.7867 56.9897 102.0057 136.4408 139.0270 162.0542 176.8701 203.9820 239.5377 243.8344 249.6815 260.5590 330.9448 352.0042 383.7084 422.1497 434.3188 460.2624 482.0931 492.2996 501.1443 521.6580 547.5707 584.0261 603.7960 619.2888 638.0618 639.7704 650.7025 688.6794 709.8526 716.2167 737.3814 740.9171 748.6138 780.9359 805.6305 827.0502 847.1206 869.1170 886.4366 905.3588 938.6687 945.7867 963.9946 972.1315 975.0186 987.3512 996.1020 1024.6570 1065.9773 1092.1128 1099.6093 1125.1891 1130.9500 1150.4095 1165.6676 1170.2000 1188.3322 1202.0835 1214.8593 1227.7738 1261.3521 1297.4661 1305.1468 1309.3416 1318.5113 1353.8504 1373.5992 1386.5368 1389.7344 1424.9435 1435.9003 1445.1007 1462.3881 1465.3179 1469.7990 1486.8534 1587.2975 1590.7652 1621.2559 1626.5869 1681.4947 1723.5023 2982.8689 2994.8495 3027.0600 3095.6374 3110.5090 3122.3308 3129.1095 3132.0304 3142.9587 3146.0173 3156.5698 3161.8859 3586.9294 3603.3182
redmass: 4.5056 6.6101 8.5639 5.9914 3.8977 4.4988 8.0428 4.0553 1.1519 2.2914 2.9842 3.5747 6.7836 5.5867 4.3520 6.4627 2.7379 2.8516 5.0634 1.3318 3.6641 3.1814 3.8462 5.8705 3.8510 8.5521 3.8173 6.0814 4.2983 1.3608 5.4051 3.4613 5.0145 3.0856 5.3923 2.0673 2.2624 3.6781 4.2763 1.5259 1.3878 1.4686 2.7226 1.5711 2.0863 1.5300 1.6483 2.6669 1.3352 6.7246 2.1469 2.3777 2.6820 2.1583 2.0636 1.1527 1.8959 1.7423 1.2829 1.7148 1.8372 3.8116 2.5513 2.5156 1.4911 1.8741 1.9868 4.7080 1.6710 6.9200 1.8277 1.9504 1.2531 3.4423 2.2578 2.6818 1.1234 1.0583 3.1780 7.1803 6.6412 7.3316 7.2812 8.5865 9.4612 1.0609 1.0350 1.0992 1.1016 1.1000 1.0854 1.0894 1.0882 1.0947 1.0918 1.0954 1.1003 1.0802 1.0799
irintensity: 0.2247 0.2394 0.5156 0.9443 0.1927 1.0029 2.1100 0.0860 0.4004 10.0403 2.7367 3.0141 0.7703 4.1384 0.8026 9.0366 16.5221 1.2090 1.2184 111.7283 15.8832 12.0093 2.4405 0.9223 6.8613 6.6079 5.6509 5.7442 23.4942 138.8880 5.8459 9.0988 41.8138 53.2321 2.5691 38.8138 38.8991 3.4922 1.4805 25.5684 0.1124 2.4691 8.7647 2.0023 11.0649 4.3827 7.1727 13.3104 0.2194 5.6504 4.4180 12.6474 19.5399 7.2653 2.1935 0.1862 4.9500 10.7542 1.3777 0.6339 16.6324 43.8276 101.1104 20.6392 1.1628 2.8147 101.8622 158.0763 10.2953 14.0331 5.0228 18.7779 5.9068 23.6466 16.6900 18.4612 6.6967 13.5331 9.1452 1.5732 0.9068 0.4878 0.6182 476.4458 512.2077 11.3927 18.7321 6.5653 27.5309 14.3390 3.7467 6.0196 3.8082 29.1600 6.6889 12.3678 39.2937 78.1318 39.2751
temp: 298.150 k
press: 1.00000 atm
elementType: 8 8 7 7 6 6 6 6 6 6 6 6 6 6 6 6 6 6 6 6 6 1 1 1 1 1 1 1 1 1 1 1 1 1 1
symmnumber: 1
zpe: 711805.6 jmol-1
zpe.correction: 0.271112 hartree
zpe.thermalcorrener: 0.287990 hartree
zpe.thermalcorrenthalpy: 0.288934 hartree
zpe.thermalcorrgfe: 0.225942 hartree
zpe.sumelectzpe: -914.770411 hartree
zpe.sumelectthermal: -914.753533 hartree
zpe.sumelectthermalent: -914.752589 hartree
zpe.sumelectthermalfe: -914.815581 hartree
dipole: -2.3761 -0.7168 2.2619
dipole: 3.3579
quadrupole: -124.9358 -120.4518 -120.4680
quadrupole: -6.7777 7.0343 -0.6892
quadrupole: -2.9839 1.5000 1.4839 -6.7777 7.0343 -0.6892
hfenergy: -915.0415236 hartree
pointgroup: C01 [X(C17H14N2O2)]
dipole: 0.9266035 0.4444095 0.8301979 debye
polarizability: 320.2879176|6.3517382|191.8939768|-4.0404088|-18.8972447|115.4170613 unknown
InChI: InChI=1S/C17H14N2O2/c1-17(15(20)18-16(21)19-17)12-6-7-14-11(9-12)8-10-4-2-3-5-13(10)14/h2-7,9,18-19H,8H2,1H3
charge 0 multiplicity 1
35 atoms
O  -2.83517 1.91469 -1.7354
O  -5.341377 -1.80955 -0.2921
N  -3.591453 -0.555427 0.730369
N  -4.206766 0.01762 -1.345312
C  -2.714813 0.588179 0.408314
C  -1.219825 0.208786 0.346836
C  1.100264 0.865522 -0.018428
C  1.528104 -0.473335 0.240203
C  2.304611 1.743617 -0.337316
C  -0.258131 1.209195 0.03272
C  2.9969 -0.530981 0.117472
C  3.474478 0.771963 -0.22396
C  -3.226328 0.958069 -1.028432
C  -2.971987 1.780803 1.368123
C  -0.792867 -1.123637 0.581738
C  0.576399 -1.471412 0.536133
C  -4.476212 -0.903829 -0.280259
C  3.897812 -1.60716 0.278377
C  4.849416 1.001831 -0.405387
C  5.279971 -1.371146 0.095351
C  5.753374 -0.078497 -0.243658
H  2.399949 2.590661 0.370124
H  2.231372 2.186442 -1.350158
H  -0.582564 2.229258 -0.19754
H  -3.627583 -1.005878 1.642725
H  -2.438094 2.67781 1.015602
H  -4.050359 2.012802 1.412933
H  -2.612649 1.535432 2.383049
H  -1.538342 -1.898818 0.785715
H  0.883298 -2.506545 0.72215
H  -4.721738 -0.010663 -2.22566
H  3.538653 -2.608973 0.539824
H  5.223185 1.998126 -0.668456
H  5.993873 -2.193629 0.215947
H  6.827996 0.085275 -0.381843
