program: Gaussian 09
title: 000256458
version: EM64L-G09RevD.01
frameworkgroup: C1[X(C14H11F2N3O)]
method: RPBEPBE
basis: SDD
operation: Freq
keyword: #p
keyword: freq=noraman
keyword: PBEPBE/SDD
title: #p freq=noraman PBEPBE/SDD
converged: YES YES NO NO
title: Mulliken charges:
elementType: F F O N N N C C C C C C C C C C C C C C H H H H H H H H H H H
charge: -0.171396 -0.203292 -0.213748 -0.447494 -0.109187 -0.115447 0.138269 0.243221 0.344673 0.245505 -0.450796 -0.510774 0.227749 0.181415 -0.335273 -0.294933 -0.770177 -0.201764 -0.198690 -0.232164 0.302586 0.281245 0.322502 0.254659 0.275073 0.260169 0.261487 0.216554 0.234751 0.231602 0.233677
chargesum: 0.00000
title: Mulliken charges with hydrogens summed into heavy atoms:
elementType: F F O N N N C C C C C C C C C C C C C C
charge: -0.171396 -0.203292 -0.213748 -0.124991 -0.109187 -0.115447 0.138269 0.243221 0.344673 0.245505 -0.148211 -0.229530 0.227749 0.181415 -0.080614 -0.019860 -0.031968 0.032987 0.032912 0.001513
polarizability: 4.54225638e+02 9.24413426e+00 1.70926169e+02 -5.77715402e+00 4.72181575e-01 8.11442304e+01
1716.lowfreq: -6.1798 -2.2478 -0.0005 0.0003 0.0008 3.0578 23.5639 30.6221 50.9234
frequency: 23.5561 30.6192 50.9216 55.6727 71.9757 75.0880 103.0081 123.6897 161.8373 187.8192 226.7754 239.8092 257.2694 265.8229 278.7612 288.3589 365.3457 390.6683 406.6334 441.3609 481.1853 507.3966 517.9683 543.1298 552.3686 570.2038 576.0782 578.7313 608.3469 631.7323 644.6473 692.0542 702.4266 722.6704 784.4806 818.2665 853.8280 873.3451 875.8585 906.8071 913.4880 946.3473 970.0893 982.3521 986.3105 989.7770 997.3130 1004.0145 1014.6229 1038.0815 1073.6679 1088.3403 1153.8688 1171.7081 1181.3325 1200.3882 1208.4235 1236.5034 1305.1422 1316.3287 1353.9923 1368.2330 1386.4758 1391.2020 1436.7008 1443.2283 1446.4575 1460.6048 1465.1841 1470.1146 1494.2702 1574.5288 1581.9173 1601.7136 1617.8080 1649.7831 2995.4037 3084.9365 3121.8203 3131.1096 3142.6880 3155.1142 3167.9929 3174.4358 3184.7696 3190.2225 3530.7437
redmass: 4.2169 5.4898 4.9540 1.1520 4.8413 4.6755 6.2234 7.1224 8.7926 6.8567 7.1616 5.9963 8.2043 6.4702 6.6560 5.8568 5.1459 6.0170 2.9017 7.6717 5.6932 3.3782 7.2987 8.8697 4.9716 1.5127 2.9895 4.0101 6.3165 4.7496 4.1308 1.8783 5.6169 4.4817 1.7448 5.0409 1.2466 1.4626 6.5464 1.5570 5.9389 1.4397 3.6443 2.8630 5.7430 1.3745 2.7907 1.3284 2.0804 1.6762 1.6458 1.9394 1.4620 1.0607 1.3695 3.0237 2.9082 3.1637 1.4758 3.6470 8.1114 6.0322 1.2220 8.9851 4.8220 1.5765 1.7152 1.6209 2.1404 1.1319 5.1517 6.8883 6.1973 6.2459 8.6881 7.0329 1.0373 1.0985 1.0990 1.0854 1.0889 1.0931 1.0960 1.1000 1.0918 1.0932 1.0767
irintensity: 0.0943 1.6755 1.9511 0.3185 3.0712 4.5347 6.5543 2.7883 1.3036 2.2627 0.3894 0.2471 1.8764 0.3430 7.1389 0.4191 4.3715 7.6176 0.0425 2.0981 3.6716 3.9878 12.4453 17.9562 2.3957 150.7418 35.7572 0.5126 2.0737 14.7047 2.7231 53.3092 11.1633 9.3839 47.7112 2.5762 0.0090 17.5130 1.4308 36.6767 9.6253 10.2553 47.2768 40.0739 1.4382 0.0047 63.2836 0.6385 11.5713 34.9442 12.3738 4.8171 35.1869 0.2775 3.4330 38.6351 207.8497 13.4774 38.3315 195.2567 28.0064 153.7380 67.1887 6.6597 67.2809 74.7542 26.9052 107.0481 21.3497 59.5796 414.5789 64.0547 0.4759 8.8685 36.0413 120.1107 10.3368 15.4611 9.4917 1.6243 9.2616 20.2915 15.6833 34.0446 5.1864 0.9447 43.7863
temp: 298.150 k
press: 1.00000 atm
elementType: 9 9 8 7 7 7 6 6 6 6 6 6 6 6 6 6 6 6 6 6 1 1 1 1 1 1 1 1 1 1 1
symmnumber: 1
zpe: 585488.7 jmol-1
zpe.correction: 0.223001 hartree
zpe.thermalcorrener: 0.240930 hartree
zpe.thermalcorrenthalpy: 0.241875 hartree
zpe.thermalcorrgfe: 0.174764 hartree
zpe.sumelectzpe: -977.811878 hartree
zpe.sumelectthermal: -977.793948 hartree
zpe.sumelectthermalent: -977.793004 hartree
zpe.sumelectthermalfe: -977.860115 hartree
dipole: -1.0321 2.3733 -1.9441
dipole: 3.2369
quadrupole: -73.8476 -114.9924 -119.9805
quadrupole: 10.6239 -9.9254 2.6847
quadrupole: 29.0925 -12.0522 -17.0403 10.6239 -9.9254 2.6847
hfenergy: -978.0348789 hartree
pointgroup: C01[X(C14H11F2N3O1)]
dipole: -0.4155074 -0.9933235 -0.680028 debye
polarizability: 453.8470349|-16.5137023|88.9211329|-1.4819312|24.3301894|163.5278692 unknown
InChI: InChI=1S/C14H11F2N3O/c1-9(20)17-14-12(15)7-11(8-13(14)16)19-18-10-5-3-2-4-6-10/h2-8,17H,1H3
charge 0 multiplicity 1
31 atoms
F  2.517382 -0.12948 2.228448
F  2.913266 -0.91707 -2.514538
O  4.544256 1.433667 1.16243
N  4.181238 -0.508966 -0.095149
N  -1.484076 -0.214973 -0.644298
N  -2.19415 0.062041 0.420182
C  2.773429 -0.429044 -0.162717
C  -0.074664 -0.277465 -0.406745
C  1.931544 -0.194786 0.960687
C  2.102325 -0.632028 -1.394401
C  0.543739 -0.092992 0.861798
C  0.717499 -0.569929 -1.548278
C  5.006796 0.419918 0.581513
C  -3.606587 0.127903 0.198577
C  -4.380785 0.430382 1.350467
C  -4.246426 -0.082936 -1.057212
C  6.489107 0.066325 0.553844
C  -5.784707 0.522824 1.25374
C  -5.647014 0.011338 -1.143951
C  -6.420559 0.313613 0.007303
H  -0.07115 0.095565 1.745554
H  0.243747 -0.724001 -2.520596
H  4.631761 -1.154034 -0.74905
H  -3.858435 0.587722 2.299843
H  -3.630579 -0.314029 -1.931563
H  6.7582 -0.433814 1.50214
H  7.077299 0.994643 0.486813
H  6.766259 -0.604107 -0.278622
H  -6.380454 0.756594 2.142385
H  -6.146017 -0.149144 -2.106164
H  -7.511144 0.385063 -0.07064
