program: Gaussian 09
title: 000256456
version: EM64L-G09RevD.01
frameworkgroup: C1[X(C12H8F2N2)]
method: RPBEPBE
basis: SDD
operation: Freq
keyword: #p
keyword: freq=noraman
keyword: PBEPBE/SDD
title: #p freq=noraman PBEPBE/SDD
converged: YES YES NO NO
title: Mulliken charges:
elementType: F F N N C C C C C C C C C C C C H H H H H H H H
charge: -0.199935 -0.199941 -0.116435 -0.112243 0.257229 0.178334 -0.457991 -0.512857 0.415250 0.415586 -0.520318 -0.333447 -0.290968 -0.201557 -0.198233 -0.230247 0.303666 0.282159 0.286655 0.254803 0.276665 0.235837 0.233099 0.234889
chargesum: 0.00000
title: Mulliken charges with hydrogens summed into heavy atoms:
elementType: F F N N C C C C C C C C C C C C
charge: -0.199935 -0.199941 -0.116435 -0.112243 0.257229 0.178334 -0.154325 -0.230698 0.415250 0.415586 -0.233663 -0.078643 -0.014303 0.034280 0.034866 0.004641
polarizability: 3.24598876e+02 -4.55481990e+00 1.46663202e+02 -7.47534858e-03 -5.45174808e-02 5.45860548e+01
1716.lowfreq: -7.9113 -5.4895 -0.0007 -0.0003 0.0011 6.0380 23.6902 53.6871 63.6293
frequency: 23.6520 53.6837 63.6282 115.4740 182.8527 210.7770 234.0228 244.6485 267.1910 303.1602 314.7677 406.2332 426.3740 487.8451 501.3955 503.5263 544.1074 558.4635 577.2906 602.2353 609.3944 680.1098 694.5385 708.9696 785.2917 849.1900 853.9039 870.0744 883.7828 904.8734 947.8666 954.2070 975.1613 984.3161 986.4755 990.3196 1004.9692 1014.1212 1074.6491 1089.3583 1096.3098 1154.3003 1172.1907 1201.5351 1224.4577 1278.6002 1306.6390 1363.7314 1390.3658 1396.2828 1439.0910 1439.9711 1448.5478 1465.4471 1581.4000 1589.2686 1602.1436 1611.6982 3131.9200 3143.3803 3155.2429 3167.9526 3174.5203 3188.5064 3190.7770 3196.7914
redmass: 4.4960 6.7966 6.6854 6.4857 6.9777 9.3023 5.0004 8.0528 6.1746 5.3413 10.5625 2.8906 6.8266 7.6131 9.0422 3.3238 9.3874 5.5605 5.0658 3.9606 6.5362 2.1775 1.7889 7.5374 1.7448 1.5207 1.2469 7.0880 1.4559 1.5940 1.4387 5.5163 3.8171 6.3230 6.1019 1.3753 1.3307 2.0758 1.5420 1.6328 1.5691 1.4363 1.0615 2.1648 1.3654 7.6062 1.4248 9.1490 8.7331 9.8091 3.1431 3.3698 3.1242 2.2788 6.1024 7.3709 6.2888 8.3052 1.0855 1.0888 1.0930 1.0960 1.1004 1.0922 1.0934 1.0941
irintensity: 0.0747 0.3801 0.6958 0.3563 0.4473 1.5270 0.0105 0.2319 0.0076 0.5692 3.5615 0.0089 5.5165 6.3136 0.4198 7.5910 32.9260 1.3214 0.0083 0.2597 0.3849 3.1479 87.2920 3.1541 48.4791 20.5756 0.0027 6.0246 15.0085 56.3357 10.3901 85.9818 37.6878 1.4431 0.8359 0.0154 0.6238 10.2253 15.6089 6.9998 24.8335 31.4260 0.3937 0.5924 2.7620 153.3822 0.1265 47.8986 2.8523 6.5580 71.1406 26.4110 12.3914 7.7024 9.4233 130.4882 14.7678 86.2295 1.0582 8.2726 17.2128 14.2319 29.9012 5.8311 2.6538 2.3956
temp: 298.150 k
press: 1.00000 atm
elementType: 9 9 7 7 6 6 6 6 6 6 6 6 6 6 6 6 1 1 1 1 1 1 1 1
symmnumber: 1
zpe: 446171.0 jmol-1
zpe.correction: 0.169938 hartree
zpe.thermalcorrener: 0.182826 hartree
zpe.thermalcorrenthalpy: 0.183770 hartree
zpe.thermalcorrgfe: 0.128849 hartree
zpe.sumelectzpe: -770.113146 hartree
zpe.sumelectthermal: -770.100257 hartree
zpe.sumelectthermalent: -770.099313 hartree
zpe.sumelectthermalfe: -770.154234 hartree
dipole: -3.3341 -0.2913 0.0021
dipole: 3.3468
quadrupole: -76.8092 -90.1586 -94.4927
quadrupole: 0.5579 -0.0044 -0.0256
quadrupole: 10.3443 -3.0051 -7.3392 0.5579 -0.0044 -0.0256
hfenergy: -770.2830836 hartree
pointgroup: C01 [X(C12H8F2N2)]
dipole: -1.3152072 0.0598115 -0.0219536 debye
dipolederiv: -0.6821083 -0.4235299 0.0085979 -0.6090851 -0.7585463 0.0143818 0.0157049 0.0170935 -0.1528682 -0.5132183 0.3220978 -0.0172277 0.6309598 -0.8837958 0.0364769 -0.0289116 0.0320735 -0.1574467 0.0074252 0.0021613 0.0010314 -0.5240992 -0.1533464 -0.0059955 0.0233021 0.00164 -0.107206 0.742234 0.0429923 0.0110441 -0.1439244 -0.1107953 -0.0013161 0.0164117 0.0012073 -0.0997572 0.1921503 0.0234073 0.0014346 0.1631863 0.27715 -0.0068181 -0.0047102 -0.0087672 0.0374217 -0.5040787 -0.0117631 -0.0073603 0.2769577 0.0514037 0.0028067 -0.0177467 -0.0012891 0.0212903 -0.409592 0.245076 -0.0131235 -0.0131631 -0.2545729 0.0040055 -0.0029125 0.0074641 -0.1436448 -0.399624 -0.2556845 0.0063964 0.0768735 -0.1252238 -0.0005893 -0.0062727 -0.0052186 -0.1678348 0.9579034 0.5348048 -0.0083918 0.7037404 0.9047372 -0.0199579 -0.0147625 -0.0224087 0.1162865 0.5873399 -0.4273633 0.0228468 -0.7605622 1.0687482 -0.046916 0.0354197 -0.0421226 0.1157837 -0.2454215 -0.0368758 0.0001876 0.0796759 -0.35523 0.0081145 -0.0044 0.0064956 -0.1711726 0.1367898 -0.1354797 0.0094905 0.2274087 0.0461383 -0.0039031 -0.004682 -0.0093335 -0.1295241 0.0639501 0.1126777 -0.0021806 -0.2435216 -0.0664286 -0.0051733 0.0116602 0.000061 -0.1021788 -0.0920984 0.1922363 -0.0069002 0.3168771 0.0264693 -0.0026625 -0.0120428 -0.004442 -0.154235 -0.3081531 -0.1702589 0.0046287 -0.3122531 0.0996672 -0.014833 0.0103677 -0.0126549 -0.1485116 0.1013404 -0.0159608 0.0041942 0.095382 0.0389863 -0.0057022 -0.0004182 -0.0074234 -0.1342679 0.1476091 -0.0637164 0.001893 -0.0329892 0.0628466 0.0042996 0.000692 0.003974 0.1873083 0.117589 0.0543442 -0.0031011 0.0405477 0.0344467 0.0064973 -0.0026592 0.0066903 0.1896617 0.0425114 0.0090876 -0.0025819 0.0094069 0.1171833 0.0035538 -0.0024501 0.0035178 0.207448 0.091537 0.0835711 -0.0044467 0.0530682 -0.0201657 0.0081986 -0.0032336 0.0086326 0.1600076 0.1028932 -0.0804664 0.0025812 -0.0480982 0.0228614 0.0048875 0.0013148 0.0043541 0.1575148 -0.0121281 -0.0912416 0.0011692 -0.1251208 -0.0432067 0.0064893 0.0024767 0.006975 0.1607179 0.006744 0.0727593 -0.0051573 0.1144723 -0.0728461 0.0110488 -0.0067806 0.0104909 0.154872 -0.1315945 0.0171248 -0.0050246 0.0242602 0.0935193 0.0031065 -0.0053671 0.0029902 0.1603351 unknown
polarizability: 323.8691827|11.9846115|147.2072009|3.3972455|-3.4759751|54.7717491 unknown
InChI: InChI=1S/C12H8F2N2/c13-9-6-10(14)8-12(7-9)16-15-11-4-2-1-3-5-11/h1-8H
charge 0 multiplicity 1
24 atoms
F  4.291018 2.367143 -0.038741
F  3.765786 -2.418087 0.135454
N  -0.175997 0.557129 -0.032607
N  -0.930496 -0.510401 -0.001761
C  1.232589 0.278985 -0.002297
C  -2.338256 -0.252313 -0.032556
C  1.794152 -1.02809 0.05547
C  2.067141 1.426002 -0.034137
C  3.456913 1.237129 -0.007538
C  3.187303 -1.136916 0.078833
C  4.060731 -0.030253 0.048874
C  -3.160219 -1.410085 0.002687
C  -2.928677 1.043208 -0.094425
C  -4.564277 -1.280078 -0.023405
C  -4.329608 1.162973 -0.120006
C  -5.151287 0.005748 -0.084679
H  1.14339 -1.90548 0.080216
H  1.624467 2.423935 -0.078345
H  5.146025 -0.153608 0.068229
H  -2.674444 -2.390238 0.050097
H  -2.275556 1.920678 -0.121082
H  -5.197718 -2.172893 0.003575
H  -4.791659 2.15527 -0.167526
H  -6.241825 0.109845 -0.105131
