program: Gaussian 09
title: 000256454
version: EM64L-G09RevD.01
frameworkgroup: C1[X(C13H10ClN)]
method: RPBEPBE
basis: SDD
operation: Freq
keyword: #p
keyword: freq=noraman
keyword: PBEPBE/SDD
title: #p freq=noraman PBEPBE/SDD
converged: NO YES NO NO
title: Mulliken charges:
elementType: Cl N C C C C C C C C C C C C C H H H H H H H H H H
charge: -0.073062 -0.709409 -0.702600 0.338516 0.314430 0.268734 0.216346 -0.680406 -0.280575 -0.422764 -0.400550 0.578228 -0.505845 -0.242900 -0.237193 0.243418 0.243437 0.236037 0.238337 0.263143 0.245390 0.223291 0.223810 0.310585 0.311602
chargesum: 0.00000
title: Mulliken charges with hydrogens summed into heavy atoms:
elementType: Cl N C C C C C C C C C C C C C
charge: -0.073062 -0.087221 -0.215745 0.338516 0.314430 0.268734 0.216346 -0.444369 -0.280575 -0.184428 -0.137407 0.578228 -0.260455 -0.019609 -0.013383
polarizability: 2.58908940e+02 9.80618842e+00 1.72006070e+02 -2.76648332e-03 -5.89154872e-03 6.35076457e+01
1716.lowfreq: -0.0024 -0.0018 -0.0016 1.5680 5.6639 9.5891 64.3464 101.7917 154.8774
frequency: 64.3426 101.7901 154.8728 183.3165 204.0656 234.7104 235.6457 303.5758 335.7640 361.7802 377.8007 396.3066 407.0620 428.1208 495.1825 524.5655 530.3256 558.8916 577.9743 610.5349 655.7429 699.5380 714.5012 738.9557 775.8097 821.0507 842.7982 844.1343 855.2179 873.2561 935.0989 965.9941 968.2021 985.5743 993.1746 1029.4965 1039.6535 1095.0703 1130.0440 1135.7877 1171.2002 1181.0077 1202.7574 1216.4884 1264.8923 1300.8242 1327.1432 1376.0143 1390.9907 1428.1669 1443.1994 1462.4366 1469.4539 1494.3171 1569.5578 1589.4942 1618.6141 1640.3742 1647.0674 2982.7040 3027.1356 3120.2520 3123.5704 3133.1406 3153.7345 3154.8356 3177.3971 3568.4537 3708.7572
redmass: 4.7032 4.8678 9.4477 4.3236 4.3132 4.7825 2.2108 6.9844 4.0300 1.0689 1.2449 4.8542 6.3877 2.8045 3.0111 4.4875 4.5185 5.4029 5.8724 3.2080 5.9604 2.8673 5.3259 1.6457 2.1753 4.6767 1.4634 8.1175 1.6542 1.3597 1.6116 1.8857 3.8405 1.3216 6.0558 2.0779 1.4557 2.2306 1.9673 1.1439 1.0875 1.3958 2.2759 1.6771 2.2197 1.5203 4.1006 5.5188 3.5333 1.1439 2.7695 2.9358 4.9594 4.6833 7.6711 6.6500 7.1954 1.5908 2.7833 1.0607 1.0994 1.0864 1.0919 1.0904 1.0922 1.0969 1.0958 1.0449 1.1041
irintensity: 1.4028 0.9726 1.4369 4.9839 0.3721 1.9274 7.6354 2.6646 6.6306 22.2200 286.2788 0.6011 2.1321 6.3490 0.0496 1.0508 0.0793 4.7486 11.1215 0.4389 4.6985 1.8979 0.4682 74.3394 27.3993 1.1347 11.9098 49.6726 34.8852 10.1451 1.4899 15.9651 1.0650 0.0204 4.2352 13.7724 6.7537 4.8219 35.6254 0.0025 1.2046 0.9878 1.6615 10.8750 9.6798 6.9975 40.4556 39.8532 6.8979 13.4351 14.7572 49.3010 63.8288 42.5909 69.6809 1.2232 31.7912 0.9647 475.5786 16.3188 8.3295 2.9045 19.4306 20.0328 11.5606 35.4455 10.8640 114.2974 22.2127
temp: 298.150 k
press: 1.00000 atm
elementType: 17 7 6 6 6 6 6 6 6 6 6 6 6 6 6 1 1 1 1 1 1 1 1 1 1
symmnumber: 1
zpe: 503207.4 jmol-1
zpe.correction: 0.191662 hartree
zpe.thermalcorrener: 0.203712 hartree
zpe.thermalcorrenthalpy: 0.204656 hartree
zpe.thermalcorrgfe: 0.153683 hartree
zpe.sumelectzpe: -1015.192186 hartree
zpe.sumelectthermal: -1015.180136 hartree
zpe.sumelectthermalent: -1015.179192 hartree
zpe.sumelectthermalfe: -1015.230164 hartree
dipole: -3.0029 -3.1952 -0.0061
dipole: 4.3848
quadrupole: -67.9467 -84.9895 -100.4580
quadrupole: 4.9815 0.0326 0.0104
quadrupole: 16.5181 -0.5247 -15.9933 4.9815 0.0326 0.0104
hfenergy: -1015.3838477 hartree
pointgroup: C01 [X(C13H10Cl1N1)]
dipole: 1.2292041 -1.210407 0.0023975 debye
dipolederiv: -0.1630419 0.1159085 0.0000149 0.0292442 -0.7683398 -0.0001287 0.0000195 -0.0001936 -0.0819479 -1.8672967 0.311053 0.0010226 0.4180054 -0.1905807 -0.0006571 0.0040056 -0.0010595 -0.7471964 -0.0102707 0.0192575 0.0000128 -0.0221404 -0.0953046 0.0000086 -0.0000475 0.0000172 0.1551017 0.3087881 -0.1441493 -0.0000809 0.0411867 0.2957371 0.0000389 0.0000557 0.0000344 -0.0137844 -0.3235698 0.1431908 0.0000998 -0.1127318 -0.5766418 -0.0001181 -0.0000111 -0.0001152 -0.0169339 -0.1803152 -0.1627103 -0.0000145 -0.3150456 0.0675515 -0.0000052 -0.0000248 0.000012 -0.0501107 0.6259994 -0.053953 0.0000027 0.1026941 -0.0642069 0.0000025 0.0000306 0.0000207 0.0176757 -0.574109 0.1059136 0.000096 -0.3564337 0.0559152 0.000015 0.0001617 -0.0000288 -0.2628942 0.7004572 -0.0475869 -0.0000911 0.0494672 1.1580858 0.0002796 -0.0000392 0.0003164 -0.0284717 0.118859 0.1150797 -0.000005 0.0925186 0.1040417 0.0000078 0.0000064 0.0000116 -0.1743982 -0.1785123 0.0475874 -0.0000136 0.0787282 0.024907 -0.0000198 -0.0000222 0.000003 -0.1607584 1.8370813 -0.2975459 -0.0007973 -0.5629196 0.2097427 0.0003319 -0.0012155 0.0003087 0.1606923 -0.6116241 0.0211894 0.0001279 0.6708207 -0.3202506 -0.0000439 -0.0001468 0.0000025 -0.2087739 -0.119664 0.0012302 0.0000142 0.1321597 -0.0257821 -0.0000058 0.000043 -0.0000121 -0.1784851 0.0076484 -0.0882277 -0.0000046 -0.1906106 0.0387558 -0.0000206 0.0000003 -0.0000153 -0.160843 0.0018512 -0.0000997 -0.0020292 0.0054999 0.0099299 0.0889364 -0.0029276 0.128108 -0.0046259 0.0018409 -0.0001046 0.0019987 0.0054862 0.0099481 -0.0889427 0.0029107 -0.1281007 -0.0046013 0.0295762 0.0609057 -0.0000039 0.0896218 -0.0967494 0.000023 0.0000446 -0.00001 0.1713996 0.0590335 -0.0376976 -0.0000014 -0.0975021 -0.1099762 0.000002 -0.000007 -0.0000105 0.1540058 0.1114817 -0.0529293 0.0000094 -0.021746 -0.0360636 0.0000148 0.0000035 -0.0000021 0.1607847 -0.0300032 -0.0748153 -0.0000536 -0.076506 0.0220611 -0.0000915 -0.0000116 -0.0000952 0.1783374 -0.1550605 -0.0404509 -0.0000068 -0.0430689 0.0805325 0.0000023 -0.000023 0.0000049 0.163145 -0.0482184 0.1025014 -0.0000082 0.1332444 -0.0359709 0.0000118 -0.0000018 0.0000135 0.1571161 0.2116052 -0.0313269 -0.0000746 -0.0864857 0.1295227 0.0004183 -0.0015117 0.0008772 0.3869702 0.247464 -0.0122199 -0.0002143 0.0365132 0.1131358 -0.0000593 -0.0012921 -0.0000872 0.3885964 unknown
polarizability: 259.5372202|-6.4161701|171.3777893|-0.0029924|0.0057801|63.5076457 unknown
InChI: InChI=1S/C13H10ClN/c14-12-7-10(15)6-9-5-8-3-1-2-4-11(8)13(9)12/h1-4,6-7H,5,15H2
charge 0 multiplicity 1
25 atoms
Cl 0.867064 3.071032 0.00053
N  4.474372 -0.680473 -0.000782
C  -0.426689 -2.004924 -0.000163
C  0.773934 -1.066721 -0.000127
C  0.320026 0.295394 -0.000131
C  -1.612637 -1.050265 -0.000099
C  -1.156003 0.306528 -0.000166
C  2.130485 -1.406903 -0.0001
C  1.316418 1.291057 0.000063
C  -2.984303 -1.350819 -0.000077
C  -2.095339 1.365674 -0.00024
C  3.113903 -0.371852 -0.000123
C  2.688297 0.989365 0.000131
C  -3.922538 -0.287775 -0.00013
C  -3.475836 1.055862 -0.000208
H  -0.427922 -2.666602 0.888281
H  -0.428004 -2.666634 -0.888604
H  2.443904 -2.457786 -0.000083
H  -3.329131 -2.39161 -0.000083
H  -1.762751 2.406564 -0.000304
H  3.425098 1.79877 0.000498
H  -4.996508 -0.505217 -0.000162
H  -4.210246 1.869356 -0.000254
H  4.78817 -1.646161 0.00147
H  5.176636 0.053036 0.000364
