program: Gaussian 09
title: 000256452
version: EM64L-G09RevD.01
frameworkgroup: C1[X(C21H25Cl2N3O)]
method: RPBEPBE
basis: SDD
operation: Freq
keyword: #p
keyword: freq=noraman
keyword: PBEPBE/SDD
title: #p freq=noraman PBEPBE/SDD
converged: YES YES NO NO
title: Mulliken charges:
elementType: Cl Cl O N N N C C C C C C C C C C C C C C C C C C C C C H H H H H H H H H H H H H H H H H H H H H H H H H
charge: -0.069229 -0.068928 -0.300068 -0.145876 -0.502298 -0.422441 0.287047 -0.708904 0.206565 0.309841 0.198681 -0.611086 0.487115 -0.437261 -0.574547 -0.395256 -0.385491 0.511909 -0.496617 -0.419042 -0.418139 -0.556146 -0.557045 0.285787 -0.359370 -0.339611 -0.689195 0.246118 0.244026 0.235546 0.232902 0.317803 0.235325 0.218717 0.234432 0.272457 0.235830 0.273562 0.211508 0.285444 0.260675 0.292504 0.261287 0.293808 0.205136 0.259558 0.283326 0.228265 0.201394 0.205930 0.205853 0.228199
chargesum: 0.00000
title: Mulliken charges with hydrogens summed into heavy atoms:
elementType: Cl Cl O N N N C C C C C C C C C C C C C C C C C C C C C
charge: -0.069229 -0.068928 -0.300068 -0.145876 -0.216855 -0.139115 0.287047 -0.218760 0.206565 0.309841 0.198681 -0.375539 0.487115 -0.204358 -0.256744 -0.159931 -0.166774 0.511909 -0.285109 0.087847 0.091253 -0.002968 -0.001950 0.285787 0.105323 0.090049 -0.049213
polarizability: 5.27643206e+02 9.49400494e+00 2.23315330e+02 -6.32604779e+00 4.17525609e+01 1.97950459e+02
1716.lowfreq: -15.5359 -7.6695 -3.1616 -0.0005 0.0013 0.0016 3.0073 10.0115 24.3318
frequency: -12.2038 9.5974 24.3129 26.8156 41.6263 42.1758 53.2917 59.4087 69.0824 82.6550 85.0268 97.4627 111.8755 133.8409 146.8299 164.7513 176.6711 214.0399 219.3213 235.1901 238.5165 253.2755 266.3791 294.0295 337.1182 354.3971 358.3793 376.3483 383.7387 395.7310 423.7050 432.1703 441.1016 471.3960 497.9112 505.8890 534.8703 548.2493 554.1971 567.7880 580.0588 598.9703 604.5473 608.5231 635.3659 676.7388 699.0797 702.9498 711.6267 735.3107 757.5186 757.8828 781.3320 802.9940 818.0305 821.3742 842.6653 864.9706 869.7534 877.5403 912.1554 912.6725 921.3922 934.0728 935.9353 938.3772 946.6135 960.5351 970.2560 987.8058 1006.1706 1023.8624 1035.1825 1048.9156 1091.4416 1105.5561 1119.4464 1131.8372 1132.5656 1142.5994 1159.0590 1159.5332 1162.3292 1181.4601 1187.5245 1204.0392 1210.2429 1231.8345 1239.2743 1249.8435 1260.1565 1274.7665 1284.6992 1290.1981 1299.8563 1305.9704 1319.4606 1341.1295 1350.8260 1357.4508 1358.9915 1371.5334 1373.6277 1384.2015 1390.1815 1426.3855 1438.4851 1439.4952 1443.8632 1448.8851 1454.1265 1462.1329 1468.0752 1473.8435 1477.5867 1480.8856 1487.7425 1490.9710 1502.2832 1514.7668 1580.3124 1596.5119 1630.6262 1634.6096 1640.6746 2970.0931 2970.1854 2972.9253 2982.6438 2986.7054 2989.0883 3026.9054 3040.3300 3053.5374 3054.2216 3068.1729 3070.9419 3073.5170 3077.5068 3078.8509 3103.0067 3126.3747 3139.9348 3142.1090 3144.4103 3145.6831 3164.2740 3179.6199 3524.9546 3554.1847
redmass: 3.4169 6.6899 7.0223 7.0708 6.1115 6.1386 5.6937 6.2107 3.7473 4.7275 5.3260 2.3795 3.3342 3.7368 4.2408 4.4043 4.1759 2.5645 1.9964 2.2874 2.3429 4.0131 3.1943 3.8347 1.8593 4.3407 2.3600 2.9693 2.9187 3.9987 2.6943 2.8318 3.1161 2.6247 2.5690 3.1741 3.2254 3.7599 2.8578 4.9773 1.3042 4.7542 4.3193 2.7492 5.4836 4.4766 4.7811 6.6818 3.1365 3.6104 3.3252 2.5671 2.3081 1.5200 1.6474 2.9444 1.4822 2.5134 1.8116 1.6893 1.6984 2.3077 1.8839 1.4092 1.3793 3.0746 2.2011 2.5670 1.9087 5.6709 1.8579 1.9763 2.9900 1.6715 2.4469 2.6218 2.2863 1.8558 1.1512 1.8124 1.1929 1.3910 1.8059 1.8475 1.4653 1.6466 1.8551 1.4854 1.5686 1.2330 1.5166 1.4693 1.4678 1.3740 1.4139 1.2746 2.2376 1.4046 1.3702 1.5807 1.3808 3.2821 3.1558 1.9411 1.2379 1.1270 1.2355 1.0971 1.6282 1.5700 2.0635 1.0793 1.5776 2.0616 1.0553 1.6005 1.3365 1.4942 1.9715 2.4077 7.0022 6.2257 7.0238 7.1865 4.3057 1.0364 1.0688 1.0692 1.0608 1.0627 1.0650 1.0994 1.0984 1.0584 1.0580 1.1001 1.0926 1.0982 1.0922 1.0992 1.0881 1.0889 1.0953 1.1011 1.1099 1.0986 1.0929 1.0931 1.0760 1.0771
irintensity: 0.4185 0.0359 0.6110 1.1248 9.0244 0.1609 0.6053 2.5542 2.1219 8.7043 6.5915 4.2914 0.6616 2.6617 1.6273 0.4617 0.6350 0.5035 0.3803 3.1559 7.3556 6.0504 1.0861 1.3584 33.4715 8.5515 17.3864 0.4065 5.1137 6.4103 16.1820 7.4776 7.0380 4.4927 1.9183 16.6958 18.9842 6.0898 7.6613 5.9397 134.8461 15.4916 22.6528 0.5862 0.2988 7.3793 8.1651 7.8611 4.9096 7.1783 0.3332 7.1397 13.3545 77.3213 29.7528 6.6058 21.0722 10.5594 0.2834 3.4011 7.2241 29.5165 59.3105 1.1393 1.4600 4.7923 12.6706 3.4562 25.0019 0.4075 3.6326 4.1604 24.4594 2.4847 4.3295 9.3888 3.6254 2.4388 0.0724 69.3349 5.6029 5.2064 1.5144 56.1342 4.1758 36.7124 449.7188 7.1213 125.7329 50.0298 5.7363 96.5337 26.0059 69.5442 11.9647 36.7796 7.6122 12.6009 71.2183 219.4490 12.9626 66.4056 6.6901 22.9386 28.8849 9.5268 59.7955 1.4091 43.2588 127.0152 13.3920 11.8825 35.3628 593.1890 18.7307 42.6076 29.8228 394.5025 40.2458 460.9866 45.9555 73.3349 13.9504 232.8202 147.9646 32.7757 46.4963 29.0305 13.1706 33.4975 62.2492 7.3361 4.1063 27.3496 13.8790 95.2679 2.0524 46.5438 9.8998 19.3786 37.9307 13.8844 23.3951 37.0408 28.4151 2.2003 33.9947 6.5858 5.3083 25.9620
temp: 298.150 k
press: 1.00000 atm
elementType: 17 17 8 7 7 7 6 6 6 6 6 6 6 6 6 6 6 6 6 6 6 6 6 6 6 6 6 1 1 1 1 1 1 1 1 1 1 1 1 1 1 1 1 1 1 1 1 1 1 1 1 1
symmnumber: 1
zpe: 1106033.9 jmol-1
zpe.correction: 0.421266 hartree
zpe.thermalcorrener: 0.447486 hartree
zpe.thermalcorrenthalpy: 0.448430 hartree
zpe.thermalcorrgfe: 0.360817 hartree
zpe.sumelectzpe: -1972.889166 hartree
zpe.sumelectthermal: -1972.862947 hartree
zpe.sumelectthermalent: -1972.862003 hartree
zpe.sumelectthermalfe: -1972.949615 hartree
dipole: -3.4580 -2.2179 -1.8362
dipole: 4.4999
quadrupole: -140.9819 -167.2087 -179.5845
quadrupole: 9.8071 6.5426 16.4074
quadrupole: 21.6098 -4.6170 -16.9928 9.8071 6.5426 16.4074
hfenergy: -1973.3104325 hartree
pointgroup: C01 [X(C21H25Cl2N3O1)]
dipole: 1.3347405 0.9586331 -0.6586107 debye
polarizability: 527.5413437|11.8441782|231.7209318|0.7080502|-38.5125112|189.6467202 unknown
InChI: InChI=1S/C21H25Cl2N3O/c1-2-9-24-21(27)25-17-3-5-19-15(13-17)12-16-14-18(4-6-20(16)19)26(10-7-22)11-8-23/h3-6,13-14,24-25H,2,7-12H2,1H3
charge 0 multiplicity 1
52 atoms
Cl -7.380466 1.118913 2.166167
Cl -6.651294 -2.973552 -1.394436
O  4.948848 -1.082081 1.118421
N  -5.210248 -0.381983 0.124243
N  4.537167 0.888287 -0.126274
N  6.731307 0.233757 0.373828
C  -1.460601 -0.31976 0.266291
C  -0.165576 -0.980294 0.732444
C  -1.160389 0.881606 -0.443765
C  0.91072 -0.028449 0.216877
C  0.299086 1.061674 -0.475122
C  -2.779977 -0.74992 0.456179
C  -3.87043 0.026477 -0.059683
C  -2.223284 1.651605 -0.960921
C  2.301565 -0.131038 0.360028
C  1.112395 2.070209 -1.037714
C  -3.555133 1.232451 -0.768389
C  3.116109 0.889717 -0.209051
C  2.512456 1.978633 -0.902237
C  -6.325933 0.434609 -0.369001
C  -5.533509 -1.627399 0.829639
C  -6.654812 1.658957 0.499422
C  -5.358596 -2.902414 -0.009315
C  5.369927 -0.05968 0.495007
C  7.751473 -0.661479 0.943241
C  8.366184 -1.642859 -0.084025
C  9.13328 -0.9436 -1.226724
H  -0.126373 -1.084378 1.834501
H  -0.044716 -1.999298 0.315147
H  -2.960982 -1.679175 1.004791
H  -2.030648 2.579626 -1.511597
H  2.776931 -0.958321 0.890651
H  0.673245 2.918652 -1.574098
H  -4.35314 1.855524 -1.181467
H  -6.113258 0.793684 -1.397233
H  -7.220917 -0.203564 -0.45455
H  -4.902412 -1.729258 1.736792
H  -6.572223 -1.567144 1.194588
H  3.149936 2.759958 -1.337805
H  4.990489 1.691556 -0.566687
H  -7.432226 2.288226 0.038065
H  -5.765519 2.252301 0.754727
H  -5.529182 -3.810567 0.590225
H  -4.38831 -2.945512 -0.523942
H  8.549706 -0.042976 1.399298
H  7.253791 -1.23018 1.747277
H  7.044024 1.027458 -0.186051
H  7.556089 -2.272705 -0.497377
H  9.051718 -2.320766 0.462657
H  8.462497 -0.301929 -1.829148
H  9.951749 -0.310956 -0.831727
H  9.583362 -1.682047 -1.914367
