program: Gaussian 09
title: 000256446
version: EM64L-G09RevD.01
frameworkgroup: C1[X(C19H13N)]
method: RPBEPBE
basis: SDD
operation: Freq
keyword: #pfreq=noraman
keyword: PBEPBE/SDD
title: #p freq=noraman PBEPBE/SDD
converged: YES YES NO NO
title: Mulliken charges:
elementType: N C C C C C C C C C C C C C C C C C C C H H H H H H H H H H H H H
charge: 0.010612 0.163355 0.135564 0.015917 0.117428 0.368850 -0.371009 -0.364501 -0.403239 -0.414689 -0.448387 -0.255310 -0.266888 -0.238350 -0.237161 0.392849 -0.322899 -0.512228 -0.189277 -0.348302 0.238476 0.271915 0.246599 0.248115 0.233144 0.227691 0.230709 0.228869 0.229108 0.247966 0.287144 0.232288 0.245642
chargesum: 0.00000
title: Mulliken charges with hydrogens summed into heavy atoms:
elementType: N C C C C C C C C C C C C C C C C C C C
charge: 0.010612 0.163355 0.135564 0.015917 0.117428 0.368850 -0.132533 -0.092587 -0.156640 -0.166574 -0.215243 -0.027620 -0.036179 -0.009481 -0.008052 0.392849 -0.074933 -0.225085 0.043012 -0.102660
polarizability: 3.63549570e+02 3.45130900e+00 2.54090031e+02 -8.82187948e+00 8.89356368e+00 9.69704771e+01
1716.lowfreq: -3.4735 -0.0009 -0.0007 -0.0005 3.7319 4.1680 39.2902 45.3730 70.4492
frequency: 39.2864 45.3685 70.4453 105.5583 137.0144 149.4592 172.0836 199.3141 258.0898 281.3948 331.3060 395.4321 398.8653 420.8358 427.7602 442.5397 500.5188 510.4440 542.5288 566.6455 593.0741 613.2174 618.1165 633.3994 670.0326 718.6794 721.7231 740.6108 752.6062 760.7761 784.3808 793.1096 810.3242 830.8019 865.4022 877.1930 885.7823 913.7067 927.5191 948.3752 949.8279 962.4940 984.3660 986.1818 989.3928 994.7594 1003.4115 1024.9222 1028.6694 1034.9234 1076.7386 1111.3800 1115.9307 1142.2986 1169.9462 1176.9928 1198.2218 1201.5156 1234.9813 1252.3794 1286.6702 1304.9377 1306.5975 1332.8903 1355.9741 1380.5044 1402.9211 1411.0135 1438.1577 1444.5031 1456.4243 1467.1054 1480.6806 1539.3050 1577.2685 1583.2854 1590.4038 1613.0020 1613.5713 1642.5701 3075.9214 3120.6747 3126.3492 3128.8732 3129.6819 3137.5537 3139.4082 3141.9439 3143.4060 3157.1083 3162.5414 3166.5146 3174.0701
redmass: 4.6357 4.6222 5.3145 4.5701 3.6904 5.0534 5.4460 4.6513 4.0667 4.6354 3.9108 3.2042 3.4668 5.4407 3.4050 3.4686 3.5309 4.8761 6.4976 3.2823 6.4722 7.3657 7.0534 3.4183 6.2949 3.2336 2.5831 1.8643 1.4948 4.9097 1.7597 2.5251 1.8860 5.6141 1.6526 1.4169 1.6713 3.7208 1.3374 1.5149 1.4870 1.4492 1.3419 1.4012 1.3563 7.0036 3.7142 2.3497 2.9356 1.9064 2.9733 1.7474 1.6166 1.7942 1.1286 1.1279 1.3697 1.8646 2.0953 2.0974 1.9275 2.0491 3.3892 1.5039 1.7012 4.1737 3.2372 2.0093 2.2876 2.7718 2.2342 2.6987 4.0672 5.0286 5.7442 6.3138 6.6966 7.0659 7.1271 8.5795 1.0868 1.0864 1.0860 1.0877 1.0884 1.0914 1.0909 1.0926 1.0940 1.0960 1.1002 1.1000 1.0970
irintensity: 1.2178 0.1787 0.3595 2.7292 0.0356 2.0545 0.1563 0.2998 0.3820 0.3080 0.0371 1.9486 4.3232 0.7059 2.3714 2.3111 1.7977 0.4002 1.3296 0.0957 7.4454 1.9270 5.4067 5.8018 0.4298 17.7453 28.1379 74.7675 11.5674 3.7765 59.5609 22.2831 20.5984 1.4723 18.8401 0.8395 0.9370 4.5282 1.1599 3.9408 10.4693 3.5498 0.0517 1.3162 0.5187 2.7804 7.6762 1.5253 0.5591 4.9894 1.4134 1.3306 11.2728 0.9052 0.8207 1.0607 2.1400 0.2677 7.4478 0.3722 6.0401 2.1949 2.0460 1.9494 1.1940 9.3960 0.1726 17.5855 32.0520 23.4645 27.8583 2.0269 42.7094 7.5597 2.5224 1.3225 0.7509 6.0244 8.9310 3.7283 10.5511 5.2972 3.4944 1.9073 1.1146 19.0081 5.7781 12.8256 27.6322 32.1066 45.3828 36.5739 13.9575
temp: 298.150 k
press: 1.00000 atm
elementType: 7 6 6 6 6 6 6 6 6 6 6 6 6 6 6 6 6 6 6 6 1 1 1 1 1 1 1 1 1 1 1 1 1
symmnumber: 1
zpe: 676637.1 jmol-1
zpe.correction: 0.257717 hartree
zpe.thermalcorrener: 0.272385 hartree
zpe.thermalcorrenthalpy: 0.273329 hartree
zpe.thermalcorrgfe: 0.215172 hartree
zpe.sumelectzpe: -785.244105 hartree
zpe.sumelectthermal: -785.229437 hartree
zpe.sumelectthermalent: -785.228493 hartree
zpe.sumelectthermalfe: -785.286651 hartree
dipole: -0.5238 -1.7058 -1.6910
dipole: 2.4583
quadrupole: -101.1938 -101.3212 -123.4280
quadrupole: -7.5793 -9.3969 0.8002
quadrupole: 7.4539 7.3265 -14.7804 -7.5793 -9.3969 0.8002
hfenergy: -785.5018222 hartree
pointgroup: C01 [X(C19H13N1)]
dipole: -0.2857408 -0.549903 -0.7425699 debye
polarizability: 362.7021531|-5.3295475|248.7871374|-14.3206827|31.0017086|103.1207879 unknown
InChI: InChI=1S/C19H13N/c1-3-9-17-15(7-1)16-8-2-4-10-18(16)19(17)12-14-6-5-11-20-13-14/h1-13H
charge 0 multiplicity 1
33 atoms
N  4.192101 -0.004859 0.916566
C  -2.537474 0.190757 0.09484
C  -1.717127 1.413384 0.1806
C  -1.65915 -0.918361 -0.115137
C  -0.33319 1.050102 0.043264
C  -0.247661 -0.431614 -0.132242
C  -2.181374 -2.222063 -0.236349
C  0.648633 2.065641 0.016471
C  -3.931126 0.001992 0.178076
C  -2.106313 2.758881 0.32768
C  0.822212 -1.274674 -0.33655
C  -3.582428 -2.41121 -0.159132
C  0.253806 3.417996 0.155871
C  -4.450234 -1.30861 0.046901
C  -1.110199 3.763783 0.321726
C  2.270079 -1.025922 -0.243132
C  3.172463 -1.690681 -1.122187
C  2.854055 -0.218909 0.780434
C  4.56042 -1.48109 -0.994521
C  5.027205 -0.618666 0.02441
H  -1.525254 -3.087353 -0.384732
H  1.706761 1.830622 -0.120563
H  -4.607084 0.84846 0.341528
H  -3.162676 3.029012 0.434458
H  0.569388 -2.31388 -0.596613
H  -4.001066 -3.418988 -0.25594
H  1.014932 4.205511 0.136802
H  -5.531427 -1.47545 0.10724
H  -1.394063 4.815826 0.43638
H  2.78008 -2.350317 -1.90499
H  2.218747 0.247036 1.541322
H  5.269975 -1.971995 -1.667964
H  6.096288 -0.413858 0.149684
