program: Gaussian 09
title: 000256443
version: EM64L-G09RevD.01
frameworkgroup: C1[X(C14H14N2O)]
method: RPBEPBE
basis: SDD
operation: Freq
keyword: #p
keyword: freq=noraman
keyword: PBEPBE/SDD
title: #p freq=noraman PBEPBE/SDD
converged: YES YES NO NO
title: Mulliken charges:
elementType: O N N C C C C C C C C C C C C C C H H H H H H H H H H H H H H
charge: -0.308597 -0.449379 -0.690208 -0.197584 0.356950 -0.557689 -0.551390 0.328475 0.359970 -0.661718 0.161156 -0.442100 0.352361 -0.446926 -0.229411 0.231440 -0.777579 0.235465 0.233104 0.233265 0.233717 0.227799 0.240447 0.215917 0.216535 0.306509 0.291725 0.361804 0.254395 0.213052 0.258494
chargesum: 0.00000
title: Mulliken charges with hydrogens summed into heavy atoms:
elementType: O N N C C C C C C C C C C C C C C
charge: -0.308597 -0.142870 -0.036679 -0.197584 0.356950 -0.089120 -0.084409 0.328475 0.359970 -0.433918 0.161156 -0.201652 0.352361 -0.231009 -0.012875 0.231440 -0.051638
polarizability: 2.56017698e+02 1.24699117e+01 2.07163720e+02 4.92169834e-01 2.15657684e-01 8.43939664e+01
1716.lowfreq: -8.0244 -0.0009 -0.0007 -0.0005 2.0962 2.9309 55.4367 68.3287 78.3421
frequency: 55.4198 68.3261 78.3411 84.4389 112.5950 153.5612 192.2712 215.1901 244.3159 274.3968 311.0420 340.8357 372.4504 431.7142 452.7656 454.9021 474.0959 490.7205 547.1317 556.1506 564.1601 574.9329 597.2866 603.2118 643.4817 676.6868 706.4902 748.7466 753.3658 772.0188 780.4899 808.0938 829.6526 843.8366 863.8310 881.0058 946.0715 958.5688 963.8079 996.5249 1010.1615 1024.0987 1040.0087 1054.9094 1069.4963 1103.1306 1142.5066 1184.6604 1187.5655 1203.0374 1217.7122 1220.1474 1249.0677 1285.4134 1294.4819 1322.3052 1376.0911 1389.7126 1400.3629 1426.8384 1446.9147 1447.9789 1459.0071 1466.7149 1469.5993 1486.9688 1504.5697 1509.2880 1579.1057 1604.2222 1612.0066 1642.2440 1665.0291 2989.3647 2994.3894 3002.5282 3032.3130 3054.4248 3091.8744 3101.5908 3113.8374 3117.4313 3132.1072 3151.3645 3267.6918 3499.2826 3607.2795
redmass: 3.4634 3.6096 1.3253 1.8991 3.1038 4.3349 4.0510 3.1554 4.2746 6.2893 4.2621 3.5876 4.0435 4.9451 4.8783 3.4188 4.2139 1.1581 3.7264 4.0264 5.6537 3.2866 3.0989 5.5875 1.3570 2.9844 4.8360 3.4982 1.9435 1.4893 1.3144 3.9868 2.2312 4.3001 1.5893 1.4018 4.4851 3.8062 1.3563 1.6758 1.9728 3.7350 1.6150 2.3273 3.0397 2.0046 1.1750 2.6807 1.1963 1.1034 1.5091 1.2676 2.1613 1.9811 1.7942 3.3481 3.0619 1.2229 3.2098 5.9665 1.1842 1.0506 2.3681 1.1321 1.1899 4.6592 2.3946 4.3389 3.1053 7.2510 6.9376 6.6612 1.3268 1.0591 1.0362 1.0618 1.1026 1.1023 1.0994 1.0992 1.0851 1.0915 1.0915 1.0979 1.0648 1.0758 1.0865
irintensity: 0.5910 7.2244 0.0473 0.7685 0.4574 7.1580 3.7450 8.2672 3.1024 2.7481 1.0850 5.4645 6.3402 3.1214 0.5869 0.8146 8.9747 76.1111 3.6786 8.2448 1.8801 4.7122 5.9943 10.9720 52.4586 25.1827 2.9374 48.8989 17.8473 77.2736 161.4935 5.0149 1.5790 1.9968 30.2349 16.7691 1.3083 11.0972 1.0528 3.6469 0.0125 1.6434 17.6451 3.1864 1.9866 17.7590 0.5895 3.1028 6.4835 0.0187 0.0625 2.3853 3.6555 19.8398 27.1992 44.0796 12.3603 56.8949 5.9896 87.5091 6.8241 16.6047 133.6896 19.7075 21.2884 44.8383 214.2568 7.2513 193.9224 53.3443 5.0930 249.8993 53.5201 21.5020 15.6080 62.7873 0.1576 32.9005 13.7541 12.0533 3.4163 19.8797 23.8420 35.0884 208.5576 22.3524 36.0461
temp: 298.150 k
press: 1.00000 atm
elementType: 8 7 7 6 6 6 6 6 6 6 6 6 6 6 6 6 6 1 1 1 1 1 1 1 1 1 1 1 1 1 1
symmnumber: 1
zpe: 655994.8 jmol-1
zpe.correction: 0.249855 hartree
zpe.thermalcorrener: 0.264352 hartree
zpe.thermalcorrenthalpy: 0.265297 hartree
zpe.thermalcorrgfe: 0.208466 hartree
zpe.sumelectzpe: -725.459529 hartree
zpe.sumelectthermal: -725.445032 hartree
zpe.sumelectthermalent: -725.444087 hartree
zpe.sumelectthermalfe: -725.500918 hartree
dipole: 1.2819 0.6715 -1.6985
dipole: 2.2314
quadrupole: -91.4405 -84.0910 -105.7043
quadrupole: -9.6932 7.0718 -0.5270
quadrupole: 2.3048 9.6543 -11.9590 -9.6932 7.0718 -0.5270
hfenergy: -725.709384 hartree
pointgroup: C01 [X(C14H14N2O1)]
dipole: -0.5071002 -0.2331745 -0.6776426 debye
polarizability: 253.9666658|16.0426255|208.0186792|-4.4141726|11.0812967|85.5900389 unknown
InChI: InChI=1S/C14H14N2O/c1-8(17)16-14-11-4-2-3-9-5-6-10(13(9)11)7-12(14)15/h2-4,7,16H,5-6,15H2,1H3
charge 0 multiplicity 1
31 atoms
O  3.824907 0.910222 0.783192
N  2.267996 -0.317731 -0.477271
N  1.867632 2.591209 -0.082452
C  -1.427946 -0.014127 -0.005592
C  -1.637793 1.39151 0.111079
C  -3.137545 1.657708 0.228588
C  -3.809215 0.231047 0.155576
C  -2.643418 -0.748578 0.018573
C  -0.132953 -0.603192 -0.122398
C  -0.536359 2.233276 0.117115
C  0.999119 0.287681 -0.16497
C  -2.597477 -2.143812 -0.077262
C  0.804826 1.696655 -0.032818
C  -0.110294 -2.039647 -0.199143
C  -1.311858 -2.770556 -0.180395
C  3.545428 -0.042357 -0.021522
C  4.641176 -0.957379 -0.560919
H  -3.382733 2.166808 1.179389
H  -3.498163 2.314188 -0.585274
H  -4.499779 0.157082 -0.705418
H  -4.40822 0.0210 1.061327
H  -0.643139 3.320403 0.221178
H  -3.505675 -2.756012 -0.063917
H  0.838918 -2.588142 -0.230386
H  -1.263508 -3.864973 -0.232097
H  2.192152 -1.129558 -1.096745
H  1.656998 3.583742 0.009971
H  2.790648 2.252714 0.241448
H  5.342906 -0.363364 -1.172364
H  4.264601 -1.796561 -1.171459
H  5.212968 -1.362157 0.291165
