program: Gaussian 09
title: 000256441
version: EM64L-G09RevD.01
frameworkgroup: C1[X(C13H6ClNO3)]
method: RPBEPBE
basis: SDD
operation: Freq
keyword: #p
keyword: freq=noraman
keyword: PBEPBE/SDD
title: #p freq=noraman PBEPBE/SDD
converged: NO NO NO NO
title: Mulliken charges:
elementType: Cl O O O N C C C C C C C C C C C C C H H H H H H
charge: -0.014693 -0.135609 -0.190442 -0.198474 0.019908 0.441175 0.327979 0.230194 0.221413 -0.299302 -0.304999 -0.582885 -0.388271 -0.406899 0.434289 -0.410401 -0.214753 -0.222700 0.334502 0.276564 0.286116 0.313368 0.239804 0.244117
chargesum: 0.00000
title: Mulliken charges with hydrogens summed into heavy atoms:
elementType: Cl O O O N C C C C C C C C C C C C C
charge: -0.014693 -0.135609 -0.190442 -0.198474 0.019908 0.441175 0.327979 0.230194 0.221413 -0.299302 -0.304999 -0.248383 -0.111707 -0.120783 0.434289 -0.097033 0.025050 0.021417
polarizability: 3.01902667e+02 -5.44002740e+00 1.99020231e+02 -7.52159263e-03 -3.25465533e-03 5.96122772e+01
1716.lowfreq: -3.8451 0.0012 0.0014 0.0020 2.4570 6.6822 48.2923 56.8389 94.8951
frequency: 48.2917 56.8363 94.8900 134.2777 135.8796 164.9319 170.6224 209.0912 243.8262 288.4055 312.1197 322.9654 345.7499 414.1037 455.0476 491.7342 512.2843 515.4001 535.7608 550.2109 592.6310 663.0520 669.1989 671.7413 706.1356 736.3966 758.0232 785.6564 790.5647 837.1788 839.5049 908.0966 931.9800 951.7337 964.1866 978.9879 995.1768 1005.9285 1031.1899 1064.5793 1087.7352 1145.6125 1170.0414 1182.0195 1200.1430 1210.4599 1237.0611 1289.5044 1357.8070 1377.2894 1392.6067 1429.3467 1439.7384 1455.1834 1480.9544 1581.1662 1589.8922 1600.2854 1615.5731 1638.1840 3141.5083 3154.4220 3169.9481 3184.5479 3185.5927 3185.6988
redmass: 9.0808 15.0547 6.8361 9.2240 6.1932 17.2474 6.5402 4.7569 8.7783 11.1222 8.3341 5.9339 17.5297 3.5906 4.6998 7.9986 7.9784 5.1653 7.4398 3.6276 7.1607 9.0035 6.4049 5.7733 5.5158 8.3222 1.5254 8.4995 3.4705 3.1673 9.8476 1.4664 1.4345 7.9425 1.5069 1.4956 6.2482 1.3696 2.1432 1.8199 2.0424 3.7521 1.4810 1.3586 3.7451 4.7306 2.5855 1.5836 4.9229 6.6807 7.4473 2.6621 4.1561 2.6372 6.2397 9.4585 7.7252 7.4119 7.9865 11.7737 1.0867 1.0917 1.0977 1.0929 1.0946 1.0954
irintensity: 0.3117 0.0659 1.0999 0.4373 4.4678 1.8645 2.5141 0.9739 1.5974 3.1437 0.5937 1.9067 2.9618 0.1431 6.0978 2.6975 3.4047 1.5969 1.8552 0.0199 7.2050 15.3109 4.0206 3.6272 10.1268 14.0490 94.6925 26.5249 7.3017 0.5985 16.8189 0.4631 14.7208 44.6081 15.2797 11.9083 5.0982 0.0760 3.2409 36.7427 32.0780 39.2320 23.9888 7.0470 340.3649 173.9914 52.8307 2.1661 19.9763 19.5238 93.1604 36.9126 23.9974 8.0718 6.7367 1.9234 97.7488 31.1700 89.4472 132.6829 1.9426 5.1932 18.8581 10.5510 17.0294 1.7750
temp: 298.150 k
press: 1.00000 atm
elementType: 17 8 8 8 7 6 6 6 6 6 6 6 6 6 6 6 6 6 1 1 1 1 1 1
symmnumber: 1
zpe: 415024.6 jmol-1
zpe.correction: 0.158075 hartree
zpe.thermalcorrener: 0.171831 hartree
zpe.thermalcorrenthalpy: 0.172775 hartree
zpe.thermalcorrgfe: 0.116603 hartree
zpe.sumelectzpe: -1238.177976 hartree
zpe.sumelectthermal: -1238.164220 hartree
zpe.sumelectthermalent: -1238.163276 hartree
zpe.sumelectthermalfe: -1238.219448 hartree
dipole: -6.2076 2.8713 0.0010
dipole: 6.8395
quadrupole: -112.2947 -116.7768 -109.7958
quadrupole: 1.2424 0.0041 -0.0018
quadrupole: 0.6610 -3.8210 3.1600 1.2424 0.0041 -0.0018
hfenergy: -1238.3360506 hartree
pointgroup: C01 [X(C13H6Cl1N1O3)]
dipole: 2.4400102 1.134503 -0.0003879 debye
dipolederiv: -0.096289 -0.1781538 0.0000003 -0.052308 -0.7150928 -0.0000111 0.0000073 -0.0000223 -0.0423992 -0.4836355 0.005804 0.0000001 0.0104832 -1.0196742 -0.0000816 0.0000004 0.0000883 -0.2850889 -0.7581064 -0.1943944 0.0000353 -0.341851 -0.6964113 -0.0000471 0.0001515 0.0001624 -0.2155879 -0.9720173 0.1663592 -0.0000007 0.2953985 -0.5667177 0.000087 0.0002259 -0.0000963 -0.2205822 2.2524543 0.1290725 -0.0001351 0.1966058 1.0451255 -0.0000703 -0.0002718 -0.0000497 0.1838632 0.7735586 -0.1849095 -0.0000198 -0.0621445 -0.1624247 -0.000001 0.0000369 -0.0000243 0.0511973 -0.2261236 0.0491554 0.0000078 0.1044129 0.0907156 0.0000096 -0.0000538 -0.0000117 -0.0137459 -0.7282305 0.2130804 0.0000264 -0.1123492 -0.211782 0.0000073 0.0000284 -0.0000226 0.0418818 -0.5664194 -0.2267808 -0.0000071 -0.3094256 -0.2633645 0.0000001 -0.0000286 -0.0000187 0.0462999 1.216469 -0.0157123 -0.0000081 -0.0453205 1.1968056 0.000066 0. -0.000018 0.1123719 -0.4878111 0.4615805 0.0000297 0.3050581 1.1416985 0.0000162 0.0000127 0.0000459 -0.0649152 0.3486689 0.0645501 -0.0000144 -0.0822273 -0.0419067 0.0000271 -0.0000761 -0.0000177 -0.0838417 -0.1503245 -0.1672688 -0.0000114 0.0710633 0.0472424 0.0000021 0.0000138 0.0000025 -0.1268134 -0.017297 0.0330551 0.0000081 -0.2033017 0.1511716 0.000021 -0.0000155 0.0000121 -0.106084 -0.9336159 -0.1394773 0.0000835 -0.2201163 0.0551405 0.0000335 0.0000137 0.0000026 0.0515513 0.2745901 -0.1750263 -0.000009 0.2843225 -0.2545796 -0.0000244 -0.0000784 -0.0000154 -0.0466149 0.0872102 0.1584227 0.0000164 0.2090089 0.0377391 0.0000085 0.0000104 0.0000141 -0.1186102 0.1134467 -0.0350944 0.000015 -0.0525453 -0.1096978 -0.0000009 0.0000269 -0.0000008 -0.1519378 0.1420645 -0.0080891 0. -0.0012942 0.101891 -0.0000077 0.0000112 -0.0000024 0.1757222 0.1175564 0.0473689 0.0000009 0.0149792 -0.0110548 -0.0000069 0.0000089 -0.000005 0.1607613 0.0891093 0.0039109 -0.0000021 0.0602468 -0.0148671 -0.0000109 -0.0000086 -0.0000085 0.160768 0.1360222 0.0393646 -0.0000021 -0.0004601 0.1125911 -0.0000046 0.0000088 -0.0000019 0.173073 -0.0273402 -0.0822601 -0.0000073 -0.1111594 0.0005249 -0.0000104 -0.0000159 -0.0000118 0.1552051 -0.1039396 0.0354427 -0.0000065 0.0429239 0.0869272 -0.0000016 -0.0000085 -0.0000007 0.1635263 unknown
polarizability: 301.8807305|5.6436099|199.0421676|-0.007528|0.0032398|59.6122772 unknown
InChI: InChI=1S/C13H6ClNO3/c14-11-6-7(15(17)18)5-10-12(11)8-3-1-2-4-9(8)13(10)16/h1-6H
charge 0 multiplicity 1
24 atoms
Cl -0.199204 3.347454 0.000002
O  0.855441 -2.996463 -0.000081
O  -4.372136 -1.51026 0.000352
O  -4.791983 0.735424 0.000293
N  -3.992017 -0.27782 -0.000051
C  0.229588 0.557083 -0.000139
C  1.716209 0.511369 -0.000142
C  -0.267409 -0.787485 -0.00021
C  2.120353 -0.86071 -0.000225
C  0.906342 -1.738128 -0.000318
C  -0.712851 1.602265 -0.000044
C  -1.62825 -1.101308 -0.000165
C  2.692154 1.527008 -0.000058
C  3.471354 -1.236558 -0.000203
C  -2.529334 -0.010094 -0.000088
C  -2.097804 1.332429 -0.000008
C  4.061243 1.148388 -0.000039
C  4.451826 -0.21231 -0.0001
H  -1.987403 -2.133401 -0.000214
H  2.414079 2.583122 -0.000014
H  3.74845 -2.295591 -0.000252
H  -2.838532 2.13625 0.000044
H  4.830013 1.928543 0.000025
H  5.515475 -0.471504 -0.000065
