program: Gaussian 09
title: 000256440
version: EM64L-G09RevD.01
frameworkgroup: C1[X(C15H10ClNO2)]
method: RPBEPBE
basis: SDD
operation: Freq
keyword: #p
keyword: freq=noraman
keyword: PBEPBE/SDD
title: #p freq=noraman PBEPBE/SDD
converged: NO YES NO NO
title: Mulliken charges:
elementType: Cl O O N C C C C C C C C C C C C C C C H H H H H H H H H H
charge: -0.047603 -0.143980 -0.240160 -0.455202 0.439125 0.231469 0.331901 0.217792 -0.319850 -0.576750 -0.307220 0.560237 -0.405215 -0.534453 -0.416524 -0.217940 -0.232904 0.217950 -0.798677 0.356487 0.271213 0.249150 0.281277 0.232167 0.237232 0.317717 0.239372 0.273991 0.239399
chargesum: 0.00000
title: Mulliken charges with hydrogens summed into heavy atoms:
elementType: Cl O O N C C C C C C C C C C C C C C C
charge: -0.047603 -0.143980 -0.240160 -0.137485 0.439125 0.231469 0.331901 0.217792 -0.319850 -0.220264 -0.307220 0.560237 -0.134002 -0.285304 -0.135247 0.014227 0.004328 0.217950 -0.045914
polarizability: 3.30777855e+02 4.72470195e-01 2.10493755e+02 1.95676947e-03 -1.61673780e-05 7.33903987e+01
1716.lowfreq: -68.8593 -5.6490 0.0009 0.0013 0.0018 0.6685 3.7760 41.0620 53.8369
frequency: -68.8497 41.0499 53.8330 82.8805 99.5481 111.5733 147.6722 153.6202 203.8006 219.2229 224.0841 251.2105 289.3763 315.3786 347.9646 396.4348 414.2176 452.3001 475.5342 522.4486 527.3949 546.1594 572.3943 577.3640 608.1433 646.8660 662.0858 670.8897 680.5977 741.9664 755.0291 784.2638 784.3478 838.0465 854.1722 868.7449 904.8003 937.7390 961.5419 964.5451 976.1806 987.4281 999.6645 1009.7403 1032.7175 1039.8227 1075.7993 1106.0404 1167.5166 1184.7673 1189.5041 1220.0852 1248.6569 1273.0222 1292.6788 1338.4418 1376.6097 1377.9214 1435.2020 1445.1253 1450.2449 1466.4975 1468.1981 1475.0735 1507.1189 1579.2597 1594.6056 1603.1577 1622.6401 1636.0014 1642.5144 2988.9572 3073.9166 3135.3031 3139.9382 3141.5209 3149.2279 3165.0170 3179.4921 3192.5154 3522.6655
redmass: 1.0408 6.3704 5.8465 6.2165 5.7379 4.3081 6.6054 10.9425 4.6912 9.0497 5.0185 6.2371 5.3483 11.9619 4.5950 5.7770 3.6096 6.0127 4.4836 4.4009 6.6925 5.1223 3.1283 7.9848 2.6857 1.3510 6.5163 6.3533 3.6841 5.6756 1.5494 3.0681 8.4634 3.2037 6.1490 1.6432 1.4710 6.9371 2.6840 1.4225 1.5226 3.9034 1.3599 2.4810 1.6653 2.1847 2.8100 1.9504 1.3558 1.5749 2.2542 3.0445 1.8769 2.3977 1.7967 4.1232 3.2398 1.4953 2.2299 1.6671 1.6900 5.1820 1.0464 4.0653 2.0698 6.3564 7.3734 7.6951 7.9739 7.1784 6.9822 1.0385 1.0983 1.0862 1.0978 1.0921 1.0913 1.0973 1.0968 1.0940 1.0765
irintensity: 0.0727 0.4643 13.9030 0.2981 3.1491 0.5504 0.3045 2.5040 0.9837 1.0399 0.0765 6.6426 3.2820 1.1937 0.3697 1.4547 0.1256 12.8896 11.2567 1.1264 0.3487 10.6690 2.7556 2.2687 16.1075 55.1339 10.0198 0.3028 0.6161 1.3625 100.7043 9.3758 29.1137 0.0000 23.2074 33.0894 0.8914 5.5574 67.5624 10.2172 20.6058 9.1658 0.0516 4.9390 8.0567 6.0821 20.8039 38.2867 1.4857 7.1335 46.4320 106.0353 34.0897 43.9840 17.8257 233.2500 28.1058 40.0948 6.4015 160.4908 22.1035 194.5341 20.7675 248.5434 113.9905 89.6368 86.2768 160.9650 23.8248 10.2461 193.7004 7.3518 13.6469 2.9670 6.6053 6.8582 7.8417 23.8808 11.8628 14.8115 16.1156
temp: 298.150 k
press: 1.00000 atm
elementType: 17 8 8 7 6 6 6 6 6 6 6 6 6 6 6 6 6 6 6 1 1 1 1 1 1 1 1 1 1
symmnumber: 1
zpe: 551478.7 jmol-1
zpe.correction: 0.210047 hartree
zpe.thermalcorrener: 0.225279 hartree
zpe.thermalcorrenthalpy: 0.226223 hartree
zpe.thermalcorrgfe: 0.166713 hartree
zpe.sumelectzpe: -1241.587417 hartree
zpe.sumelectthermal: -1241.572185 hartree
zpe.sumelectthermalent: -1241.571241 hartree
zpe.sumelectthermalfe: -1241.630752 hartree
dipole: 1.2447 5.3385 0.0006
dipole: 5.4817
quadrupole: -79.5247 -128.3154 -119.2835
quadrupole: 16.9362 0.0034 -0.0006
quadrupole: 29.5165 -19.2742 -10.2423 16.9362 0.0034 -0.0006
hfenergy: -1241.797464 hartree
pointgroup: C01 [X(C15H10Cl1N1O2)]
dipole: -0.5420412 2.0874418 0.0021246 debye
polarizability: 330.7262986|2.5340611|210.5451257|0.0300423|0.158283|73.3905842 unknown
InChI: InChI=1S/C15H10ClNO2/c1-8(18)17-9-6-12-14(13(16)7-9)10-4-2-3-5-11(10)15(12)19/h2-7,17H,1H3
charge 0 multiplicity 1
29 atoms
Cl 0.676944 3.518468 0.003854
O  0.721861 -2.913427 -0.003648
O  -4.140185 -1.693715 -0.002358
N  -3.600617 0.592868 -0.000003
C  0.679328 0.692418 0.000602
C  -0.033733 -0.548632 -0.000928
C  2.139285 0.407815 0.000436
C  2.314892 -1.011326 -0.001223
C  0.971416 -1.677715 -0.002172
C  -1.427277 -0.652966 -0.001208
C  -0.094273 1.861397 0.001865
C  -2.182014 0.559072 0.000125
C  3.268861 1.248524 0.001569
C  -1.503964 1.808479 0.001649
C  3.586444 -1.603284 -0.001784
C  4.55843 0.650829 0.001009
C  4.722976 -0.755096 -0.000649
C  -4.502676 -0.484675 -0.001095
C  -5.968396 -0.051914 -0.000988
H  -1.92703 -1.623028 -0.002392
H  3.166887 2.336383 0.002851
H  -2.070996 2.746228 0.002697
H  3.684577 -2.693828 -0.003072
H  5.444322 1.295803 0.001882
H  5.730011 -1.185075 -0.001048
H  -4.020876 1.525636 0.000853
H  -6.20949 0.5496 0.895138
H  -6.598301 -0.952382 -0.001773
H  -6.209205 0.550941 -0.896291
