program: Gaussian 09
title: 000256439
version: EM64L-G09RevD.01
frameworkgroup: C1[X(C13H8ClNO)]
method: RPBEPBE
basis: SDD
operation: Freq
keyword: #p
keyword: freq=noraman
keyword: PBEPBE/SDD
title: #p freq=noraman PBEPBE/SDD
converged: NO NO NO NO
title: Mulliken charges:
elementType: Cl O N C C C C C C C C C C C C C H H H H H H H H
charge: -0.060705 -0.159932 -0.700150 0.410081 0.343611 0.236569 0.217374 -0.323978 -0.279038 -0.667012 -0.410929 -0.418104 0.579125 -0.491126 -0.217091 -0.237202 0.278544 0.271176 0.278415 0.248758 0.229757 0.234917 0.316223 0.320719
chargesum: 0.00000
title: Mulliken charges with hydrogens summed into heavy atoms:
elementType: Cl O N C C C C C C C C C C C C C
charge: -0.060705 -0.159932 -0.063209 0.410081 0.343611 0.236569 0.217374 -0.323978 -0.279038 -0.388469 -0.139754 -0.139690 0.579125 -0.242367 0.012666 -0.002286
polarizability: 2.72260380e+02 1.58056529e+01 1.88578438e+02 6.49999742e-03 1.85036132e-04 5.93003993e+01
1716.lowfreq: -4.6945 -1.7184 -0.0014 -0.0006 0.0023 9.2986 59.6125 99.9807 144.5664
frequency: 59.6063 99.9803 144.5644 145.7734 194.5807 201.3637 225.6387 260.8367 312.5609 332.8630 379.5361 390.2245 408.0302 413.9012 415.3281 476.6126 529.3226 531.2045 554.0567 601.5404 601.8972 666.0552 679.5511 724.2578 752.0352 780.8955 783.2768 827.6339 853.0751 870.0944 896.8095 917.6089 970.1789 972.7058 996.6400 1000.5219 1030.3182 1045.4633 1075.0799 1106.6423 1166.9753 1186.5767 1198.7353 1246.6800 1289.9284 1316.6722 1367.9741 1392.7955 1442.3592 1451.6772 1478.3524 1496.4568 1573.5997 1592.6833 1603.6791 1626.2906 1641.5625 1648.8254 3133.4740 3142.3236 3146.9300 3154.7037 3164.1172 3177.7334 3567.4580 3707.5093
redmass: 6.9836 5.2316 6.5080 9.2045 4.8315 4.3815 5.3754 8.0779 9.6911 4.5750 1.0522 5.4941 5.4017 1.9033 1.7667 4.3545 4.4788 6.9541 6.7158 3.4848 6.3362 6.6994 3.5230 6.0375 1.5965 2.7449 8.3824 2.6283 1.6380 7.7662 1.4445 1.9362 1.4686 4.8250 1.3552 4.1752 1.7289 1.7624 2.7261 1.9624 1.3239 1.8126 1.8895 2.1385 1.5651 3.1822 6.8300 3.0920 2.6126 2.7474 6.5115 4.9940 8.4236 7.3484 8.2613 7.9846 2.0996 2.0482 1.0861 1.0924 1.0912 1.0922 1.0971 1.0969 1.0452 1.1042
irintensity: 6.5479 1.1138 0.0291 2.3687 1.6679 0.0004 2.1467 3.7512 3.2264 0.6684 1.5884 2.2482 2.0692 143.6311 179.4201 2.8492 0.0437 1.5339 3.3740 0.8084 2.5908 4.9915 0.0004 3.7740 93.0480 14.6852 29.2060 0.3550 27.9709 50.6245 10.3564 18.9989 7.4240 12.1249 0.0093 13.0351 14.6058 2.3268 18.2414 24.6117 1.7562 4.0574 12.9724 19.0667 4.7733 92.8669 10.2097 9.5525 35.0498 4.0068 98.7161 178.8388 26.0768 114.4288 219.1456 90.9051 9.1526 337.2419 3.8472 5.4056 8.8667 8.1408 24.4100 11.8305 141.1590 26.0224
temp: 298.150 k
press: 1.00000 atm
elementType: 17 8 7 6 6 6 6 6 6 6 6 6 6 6 6 6 1 1 1 1 1 1 1 1
symmnumber: 1
zpe: 455444.3 jmol-1
zpe.correction: 0.173470 hartree
zpe.thermalcorrener: 0.186087 hartree
zpe.thermalcorrenthalpy: 0.187031 hartree
zpe.thermalcorrgfe: 0.134569 hartree
zpe.sumelectzpe: -1089.159292 hartree
zpe.sumelectthermal: -1089.146675 hartree
zpe.sumelectthermalent: -1089.145730 hartree
zpe.sumelectthermalfe: -1089.198193 hartree
dipole: -3.3019 1.0069 0.0160
dipole: 3.4521
quadrupole: -62.4313 -105.1171 -103.8146
quadrupole: 10.7022 -0.0823 -0.0230
quadrupole: 28.0230 -14.6628 -13.3602 10.7022 -0.0823 -0.0230
hfenergy: -1089.3327616 hartree
pointgroup: C01 [X(C13H8Cl1N1O1)]
dipole: -1.2722607 0.4752593 0.0059408 debye
dipolederiv: -0.1266969 -0.1124998 0.0000089 0.0317782 -0.7852928 -0.0000103 -0.0000188 -0.0002415 -0.0743081 -0.5128908 0.0316647 -0.0000453 0.0412468 -1.1040369 0.0000111 -0.0001406 0.0002435 -0.3015376 -1.8510873 -0.3844385 -0.0026184 -0.4387287 -0.2057801 -0.0010942 -0.0087917 -0.0022926 -0.7315058 -0.4518971 -0.1795446 -0.0002389 0.0244712 -0.4823855 -0.0001431 0.0001466 -0.0002092 -0.0344101 0.8050141 0.1071079 0.000298 0.0905065 0.0929947 0.0000625 0.0001595 0.0001013 0.0128695 -0.3205873 0.5173394 0.0001103 0.2742955 0.0031281 0.0000659 -0.0003038 0.0002383 0.0672308 -0.7011927 -0.2512996 -0.0001897 -0.016984 -0.2827989 0.0000673 -0.0003615 -0.0000926 0.0340198 1.2247048 -0.0305472 0.000321 0.00555 1.2737361 -0.000063 0.0005625 -0.0002471 0.1008817 0.5516066 0.1421854 0.0001676 -0.0732087 1.2169941 0.0001784 -0.0000178 0.0003692 -0.0211218 -0.4695843 -0.2450839 -0.0001572 0.3948261 0.0942143 0.0003603 0.0002666 0.0003176 -0.1995283 -0.5330653 -0.167906 -0.0001065 -0.1933404 0.0202071 -0.0001244 -0.0001608 -0.0000821 -0.1563279 0.1856228 0.0615438 0.0000948 -0.1305724 0.1468843 -0.0001043 0.0001899 -0.0000016 -0.1171275 1.8991467 0.3906038 0.0015325 0.5029222 0.144928 0.0005465 0.001262 0.0004466 0.1530703 -0.4873842 -0.0691371 -0.0000852 -0.6372343 -0.3366943 -0.000253 0.0006444 -0.0002748 -0.1918788 0.2571187 0.1164654 0.0001851 0.0478953 0.0835909 -0.000023 0.0001706 0.0000071 -0.1238535 -0.0153949 -0.0211619 0.0001142 -0.0097389 -0.1616452 0.0000276 0.0001204 -0.0000312 -0.1858812 0.0581697 -0.035467 -0.0000723 -0.068898 -0.0218973 -0.0000621 -0.0000844 -0.0001697 0.1736164 0.1032814 0.0562719 -0.0000509 0.0255396 -0.0260968 0.0000401 -0.0000477 0.0000311 0.161668 0.0819363 0.0172414 -0.0000346 0.0765752 -0.029973 0.0000598 -0.0000467 0.0000375 0.1590251 -0.0246405 0.0690672 -0.0000111 0.0733246 0.0347255 -0.0000978 -0.0000832 0.0000502 0.175955 -0.0278445 -0.0952584 -0.0000609 -0.1271984 -0.025934 -0.0000315 -0.0000619 -0.0000149 0.1527179 -0.1349839 0.0271243 -0.0001468 0.0359738 0.0854919 0.0000291 -0.0001823 0.0000303 0.1676866 0.2650841 0.0153761 0.0006517 -0.0441631 0.1112448 -0.0002476 0.003421 -0.000169 0.3893199 0.2255645 0.0403526 0.0003335 0.1151617 0.1543948 0.0008059 0.0033579 0.0019538 0.3894198 unknown
polarizability: 273.8840213|10.5504171|186.9547776|0.0640398|0.0037697|59.3004182 unknown
InChI: InChI=1S/C13H8ClNO/c14-11-6-7(15)5-10-12(11)8-3-1-2-4-9(8)13(10)16/h1-6H,15H2
charge 0 multiplicity 1
24 atoms
Cl -0.994741 3.256539 -0.000147
O  0.464929 -3.007633 0.000276
N  -4.483482 -0.618488 -0.001834
C  -0.365545 0.504883 -0.000701
C  1.11931 0.546412 -0.0001
C  -0.78453 -0.865031 -0.000789
C  1.604798 -0.800894 0.00039
C  0.442551 -1.743858 -0.000101
C  -1.386947 1.464462 -0.000651
C  -2.119534 -1.266196 -0.001045
C  2.038714 1.613579 0.000229
C  2.976015 -1.098423 0.001038
C  -3.13933 -0.26147 -0.001122
C  -2.752246 1.111291 -0.000461
C  3.427488 1.31313 0.000928
C  3.898673 -0.022241 0.001306
H  -2.368571 -2.333192 -0.001717
H  1.698494 2.652005 -0.000049
H  3.31038 -2.141211 0.001335
H  -3.513337 1.897979 -0.000441
H  4.150468 2.136839 0.001154
H  4.975817 -0.218921 0.001873
H  -5.214315 0.086697 0.001891
H  -4.75966 -1.595854 0.003139
