program: Gaussian 09
title: 000256437
version: EM64L-G09RevD.01
frameworkgroup: C1[X(C13H10Br2N2)]
method: RPBEPBE
basis: SDD
operation: Freq
keyword: #p
keyword: freq=noraman
keyword: PBEPBE/SDD
title: #p freq=noraman PBEPBE/SDD
converged: NO YES NO NO
title: Mulliken charges:
elementType: Br Br N N C C C C C C C C C C C C C H H H H H H H H H H
charge: -0.021526 -0.009487 -0.693168 -0.707539 -0.709526 0.383116 0.326595 0.250888 0.169878 -0.674278 -0.655452 -0.437324 -0.367068 0.819779 0.549098 -0.484134 -0.454717 0.260291 0.260247 0.233390 0.256849 0.234123 0.216480 0.320644 0.320794 0.306133 0.305914
chargesum: 0.00000
title: Mulliken charges with hydrogens summed into heavy atoms:
elementType: Br Br N N C C C C C C C C C C C C C
charge: -0.021526 -0.009487 -0.051730 -0.095492 -0.188988 0.383116 0.326595 0.250888 0.169878 -0.674278 -0.422063 -0.180476 -0.132945 0.819779 0.549098 -0.484134 -0.238238
polarizability: 3.42052363e+02 -5.39118297e+00 2.22297394e+02 -2.49268498e-02 8.59953881e-03 7.13559199e+01
1716.lowfreq: -3.4351 -0.0001 0.0003 0.0004 3.0743 3.2744 54.1415 75.6609 84.8900
frequency: 54.1346 75.6597 84.8899 93.6918 126.5540 150.2204 210.4025 216.3602 233.4432 270.6875 273.2133 277.2859 332.0818 348.1213 359.9080 369.2830 384.0835 428.1164 437.8014 438.9080 468.4496 494.9144 537.7971 553.3450 582.3474 598.2544 639.8952 668.6962 728.5788 732.1823 751.9863 762.8375 783.4087 814.5606 853.2403 875.0793 927.5830 935.8837 949.0955 969.8592 1004.6737 1032.8569 1061.5019 1117.0766 1135.2402 1158.1254 1171.6942 1210.3426 1238.2097 1274.0336 1319.9105 1337.1904 1362.4848 1382.5608 1425.9279 1452.0100 1461.7437 1469.3841 1497.8432 1553.1855 1592.5052 1606.0214 1634.2398 1637.9556 1645.0081 2984.7417 3027.8216 3114.9189 3117.8771 3141.9406 3162.6785 3540.9985 3568.6584 3685.0296 3709.3509
redmass: 6.1688 4.1628 6.6718 9.6611 21.7116 4.8652 3.0482 18.8955 6.7200 3.1466 5.8256 4.3152 4.9266 1.2292 1.0559 3.7472 5.1422 2.5321 1.0568 1.2396 3.7370 4.9704 7.2316 3.1076 3.8999 6.0310 3.7308 7.2503 4.4309 5.7769 4.0795 6.2027 6.4704 1.4947 1.5536 1.5177 2.9750 1.4745 2.0993 2.8864 7.4072 1.5062 1.7572 2.4145 1.1366 1.4234 2.7242 1.5487 1.6677 1.6552 2.1599 5.9479 5.2955 4.5882 1.1591 5.7060 4.9341 4.6413 4.2782 7.1672 6.4980 1.9483 2.4412 1.6897 2.4554 1.0609 1.0991 1.0914 1.0871 1.0968 1.0925 1.0448 1.0448 1.1042 1.1040
irintensity: 2.5524 0.0953 0.7058 0.9111 0.2383 0.0517 4.2262 0.7275 0.4771 19.0525 5.4172 2.0973 4.2216 277.6333 11.0211 0.4244 34.9809 21.4309 32.7554 222.7276 0.8269 1.3230 27.7747 0.2799 6.2177 8.0884 9.1220 31.6253 1.6781 18.2945 10.1381 7.1158 17.6703 49.7476 29.2290 9.2279 4.8259 3.0620 12.1119 25.3472 59.3243 10.1268 59.1985 1.8979 0.0786 4.0172 48.0552 1.8251 17.9998 14.3076 30.1613 86.5376 27.5156 12.3758 5.2439 9.8554 216.6742 135.9567 70.7176 51.1292 24.0969 78.3923 185.0692 1.9830 419.8944 10.9319 5.6821 18.3127 27.7499 25.1545 2.8703 122.6422 113.4471 47.9139 20.0323
temp: 298.150 k
press: 1.00000 atm
elementType: 35 35 7 7 6 6 6 6 6 6 6 6 6 6 6 6 6 1 1 1 1 1 1 1 1 1 1
symmnumber: 1
zpe: 518154.0 jmol-1
zpe.correction: 0.197354 hartree
zpe.thermalcorrener: 0.212793 hartree
zpe.thermalcorrenthalpy: 0.213737 hartree
zpe.thermalcorrgfe: 0.153744 hartree
zpe.sumelectzpe: -636.660880 hartree
zpe.sumelectthermal: -636.645441 hartree
zpe.sumelectthermalent: -636.644497 hartree
zpe.sumelectthermalfe: -636.704490 hartree
dipole: 3.0853 0.7165 -0.0497
dipole: 3.1678
quadrupole: -76.0478 -110.7849 -125.2020
quadrupole: -4.1721 -0.0891 -0.0091
quadrupole: 27.9638 -6.7733 -21.1904 -4.1721 -0.0891 -0.0091
hfenergy: -636.8582343 hartree
pointgroup: C01[X(C13H10Br2N2)]
dipole: -1.1796912 -0.4015617 -0.0191059 debye
polarizability: 341.9311199|6.6006352|222.4186167|-0.0568925|-0.0430378|71.3559406 unknown
InChI: InChI=1S/C13H10Br2N2/c14-11-5-9-8-2-1-7(16)3-6(8)4-10(9)12(15)13(11)17/h1-3,5H,4,16-17H2
charge 0 multiplicity 1
27 atoms
Br 2.654535 -3.043897 -0.000875
Br 3.967408 2.664757 -0.002677
N  4.459301 -0.450627 0.003891
N  -5.325913 -0.221032 0.002938
C  -0.478979 -1.765495 0.000775
C  0.73314 -0.845887 0.000679
C  -1.648216 -0.785128 0.001023
C  0.311232 0.521707 0.000749
C  -1.159085 0.55709 0.000839
C  2.093908 -1.151154 0.000618
C  -3.021127 -1.060267 0.001101
C  1.271469 1.555616 0.000089
C  -2.074935 1.632209 0.000568
C  3.110092 -0.140105 0.001153
C  -3.950427 0.025117 0.001404
C  2.63351 1.209313 -0.000073
C  -3.458784 1.366515 0.000809
H  -0.485189 -2.429388 0.887416
H  -0.485573 -2.429574 -0.885679
H  -3.389136 -2.093983 0.001106
H  0.975036 2.608022 -0.000684
H  -1.724688 2.670813 0.000179
H  -4.174472 2.197923 0.000633
H  4.759458 -1.421994 -0.003188
H  5.152193 0.293485 -0.003698
H  -5.68569 -1.170458 -0.003162
H  -5.991568 0.545623 -0.004434
