program: Gaussian 09
title: 000256436
version: EM64L-G09RevD.01
frameworkgroup: C1[X(C13H9Cl2N)]
method: RPBEPBE
basis: SDD
operation: Freq
keyword: #p
keyword: freq=noraman
keyword: PBEPBE/SDD
title: #p freq=noraman PBEPBE/SDD
converged: YES YES NO NO
title: Mulliken charges:
elementType: Cl Cl N C C C C C C C C C C C C C H H H H H H H H H
charge: -0.077774 -0.071698 -0.692765 -0.696559 0.328714 0.217084 0.281485 0.190662 -0.633262 -0.425357 -0.406676 -0.379389 0.667442 -0.366463 -0.099162 -0.225941 0.247847 0.247809 0.237564 0.261368 0.265693 0.243331 0.253509 0.312029 0.320510
chargesum: 0.00000
title: Mulliken charges with hydrogens summed into heavy atoms:
elementType: Cl Cl N C C C C C C C C C C C C C
charge: -0.077774 -0.071698 -0.060226 -0.200903 0.328714 0.217084 0.281485 0.190662 -0.395699 -0.163989 -0.140983 -0.136058 0.667442 -0.366463 -0.099162 0.027568
polarizability: 3.17316198e+02 -8.72105314e+00 1.65186043e+02 -5.64423047e-03 -5.01564677e-03 6.52242550e+01
1716.lowfreq: -5.6344 -0.0015 -0.0011 0.0024 2.8101 3.4813 48.2130 83.5115 111.9711
frequency: 48.2109 83.5097 111.9711 139.4664 191.7531 213.3887 236.8890 264.8801 280.8729 299.9041 331.4526 369.4124 394.6284 421.2870 421.7985 431.8930 463.6387 468.2533 522.9181 544.5565 580.0117 626.3357 644.1778 677.7756 710.5459 729.4263 742.1780 763.4836 820.6647 849.5979 852.7693 872.7060 880.8031 944.9593 956.7256 960.1302 1003.0779 1048.2502 1062.5867 1115.3884 1133.9757 1147.8164 1177.6871 1200.1785 1225.2316 1252.0662 1277.5523 1335.6404 1373.7311 1380.4510 1418.8122 1428.1224 1456.1445 1459.3220 1493.2731 1578.5685 1582.5191 1612.0775 1623.3361 1644.0332 2984.6903 3029.5228 3124.8406 3138.0324 3157.0237 3159.8941 3172.5806 3553.0580 3701.0950
redmass: 9.3088 4.9879 11.4576 7.1908 3.5665 11.8069 3.1927 7.5917 3.5618 5.6811 7.8854 2.1849 1.6739 2.5647 5.8048 3.0145 1.1534 5.9686 3.4155 3.5774 6.1166 4.5230 7.9544 6.7879 3.8749 5.5225 2.9999 5.6271 1.4590 1.5095 4.9927 1.4482 1.4458 1.4367 3.1075 2.0688 5.5769 1.6061 1.9578 1.9486 1.1427 2.1056 1.9963 1.6935 2.1328 1.3831 1.4121 4.7860 7.6218 3.5876 2.9659 1.2688 5.0646 3.7670 4.5582 8.1963 7.5742 7.4877 1.5473 3.0876 1.0607 1.0995 1.0917 1.0898 1.0929 1.0927 1.0957 1.0455 1.1035
irintensity: 0.0779 0.5761 0.2865 2.5794 2.3745 0.0417 5.9334 2.7589 0.0162 4.6330 2.0056 48.1034 110.4263 42.3084 21.6981 1.1686 120.0074 7.9281 1.5769 1.0231 0.7958 6.4628 5.2306 20.0320 0.0144 22.9257 0.0206 5.5814 52.9716 33.7690 46.0006 7.7891 4.4844 2.5291 15.5314 19.2765 14.0868 23.5404 15.6210 22.2065 0.0394 14.3457 21.6321 0.6996 3.7245 30.2993 0.0221 47.8394 17.1928 30.3980 33.4091 15.9547 2.3216 223.3562 36.9113 16.8677 3.2963 2.8585 21.6948 385.6783 14.6731 6.9703 18.5938 8.5561 2.7570 0.8963 5.7440 138.8595 34.7422
temp: 298.150 k
press: 1.00000 atm
elementType: 17 17 7 6 6 6 6 6 6 6 6 6 6 6 6 6 1 1 1 1 1 1 1 1 1
symmnumber: 1
zpe: 477929.4 jmol-1
zpe.correction: 0.182034 hartree
zpe.thermalcorrener: 0.195327 hartree
zpe.thermalcorrenthalpy: 0.196271 hartree
zpe.thermalcorrgfe: 0.141872 hartree
zpe.sumelectzpe: -1474.584632 hartree
zpe.sumelectthermal: -1474.571339 hartree
zpe.sumelectthermalent: -1474.570395 hartree
zpe.sumelectthermalfe: -1474.624794 hartree
dipole: -3.3026 2.7621 -0.0016
dipole: 4.3054
quadrupole: -108.2610 -90.3554 -111.8627
quadrupole: -10.4636 0.0093 -0.0138
quadrupole: -4.7680 13.1376 -8.3696 -10.4636 0.0093 -0.0138
hfenergy: -1474.7666659 hartree
pointgroup: C01 [X(C13H9Cl2N1)]
dipole: -1.365019 1.0029321 -0.0001865 debye
dipolederiv: -0.6058025 -0.3117918 0.0000399 -0.4213533 -0.430383 -0.0000059 0.0002948 0.0001493 -0.0736454 -1.0762777 -0.0359072 0.0000728 -0.0993886 -0.1392699 -0.0000062 -0.0000215 -0.0000023 -0.0798652 -1.8366553 0.3973687 0.0001629 0.5387764 -0.2542903 -0.0022349 0.0025802 -0.0025653 -0.7042499 -0.008892 0.0043215 0.0000167 -0.033144 -0.0799376 -0.0000626 -0.0000912 0.0000291 0.151108 0.2101768 -0.0641867 -0.0000304 0.1099536 0.2285536 0.0000275 0.0001189 0.0001515 -0.0274886 -0.3047412 0.088955 0.000106 -0.0874081 -0.2313883 -0.0001047 0.0000935 -0.0002692 -0.0353779 -0.2126795 -0.108043 -0.0000707 -0.2845255 0.1581208 0.0001351 -0.0002019 0.0001173 -0.0458478 0.7239512 -0.1717493 -0.0001334 0.0298605 -0.1458669 -0.0000549 0.0000684 0.0000099 0.0081977 -0.4140728 0.2060284 -0.0000133 -0.3558226 0.1014223 0.0005606 0.0007723 0.0000622 -0.2343197 0.3006097 0.0212927 0.0000021 -0.1157702 -0.0509943 -0.0000147 0.0002275 0.0002092 -0.0779512 -0.1394449 0.0778365 0.0000221 0.0208857 0.0086576 0.0000655 -0.0000402 0.0000772 -0.1285159 -0.0707127 0.0455165 0.0000154 0.0887456 0.0738063 0.0000514 -0.0000473 0.000089 -0.1532576 1.5288391 -0.5812927 -0.0005842 -0.8285801 0.0408103 0.0008872 -0.0012949 0.0010745 0.1538509 0.2453899 0.460167 0.0000417 1.3494591 0.4519668 -0.0002869 -0.0017544 -0.0003584 -0.128824 1.254027 0.0641746 -0.0000489 0.3298238 0.12753 0.0000101 0.0001669 0.0000115 -0.0759168 -0.3634928 -0.0558906 -0.000005 -0.2123674 -0.0170968 0.0000219 -0.0000683 0.0000121 -0.1164265 -0.0020985 -0.0003378 -0.0077756 0.0010692 0.0174736 -0.0852802 -0.0134791 -0.1258229 -0.0003398 -0.0020237 -0.0003883 0.007789 0.0011182 0.0172646 0.085286 0.0134689 0.1258137 -0.0002513 0.0226895 0.0392979 0.0000613 0.0678554 -0.1015948 -0.0002985 0.000124 -0.0003936 0.1692063 0.1113936 0.0445726 -0.0000002 0.022261 -0.0284007 -0.000015 0.0001465 0.0000317 0.1570935 0.0678635 -0.0414033 -0.0000005 -0.0721236 -0.0230661 -0.0000539 -0.0000535 -0.0000919 0.1627833 0.0390706 -0.0908462 -0.0000125 -0.0561719 -0.0554613 -0.0000516 -0.0000129 -0.0000671 0.1536048 0.01531 0.0789701 0.0000389 0.0818378 0.0066849 -0.0000434 0.0000382 -0.0000321 0.1663527 0.2275818 -0.0471052 0.000327 -0.1095401 0.140454 0.0008488 -0.001503 0.0013805 0.383166 0.2899908 -0.0195596 -0.0000213 0.0345491 0.1850049 0.0006195 0.0004682 0.0003839 0.3769145 unknown
polarizability: 317.8093922|0.8847568|164.6928392|-0.0416927|0.0179689|65.2242647 unknown
InChI: InChI=1S/C13H9Cl2N/c14-9-1-2-10-7(4-9)3-8-5-13(16)12(15)6-11(8)10/h1-2,4-6H,3,16H2
charge 0 multiplicity 1
25 atoms
Cl -4.233487 -2.055644 0.000503
Cl 5.54139 0.055331 -0.000453
N  -4.572135 0.959917 0.001396
C  0.431503 1.923985 0.000826
C  -0.846997 1.091735 0.000449
C  -0.518983 -0.299048 -0.000051
C  1.527606 0.863027 0.000101
C  0.944878 -0.443331 -0.000159
C  -2.178121 1.522951 0.000992
C  -1.54932 -1.265347 -0.000042
C  2.921878 1.03342 -0.000125
C  1.77017 -1.589952 -0.000509
C  -3.241081 0.565589 0.000367
C  -2.877195 -0.815169 -0.000037
C  3.721522 -0.130912 -0.000489
C  3.175939 -1.431352 -0.000687
H  0.496619 2.581879 0.889423
H  0.496375 2.582482 -0.887308
H  -2.427443 2.590828 0.002388
H  -1.335866 -2.338254 -0.000034
H  3.382928 2.025647 0.000191
H  1.341618 -2.597885 -0.000734
H  3.837741 -2.302059 -0.00094
H  -4.821698 1.943816 -0.002452
H  -5.30984 0.259445 0.003883
