program: Gaussian 09
title: 000256434
version: EM64L-G09RevD.01
frameworkgroup: C1[X(C18H20N2O2)]
method: RPBEPBE
basis: SDD
operation: Freq
keyword: #p
keyword: freq=noraman
keyword: PBEPBE/SDD
title: #p freq=noraman PBEPBE/SDD
converged: YES YES NO NO
title: Mulliken charges:
elementType: O O N N C C C C C C C C C C C C C C C C C C H H H H H H H H H H H H H H H H H H H H
charge: -0.316129 -0.277922 -0.162290 -0.469451 -0.707976 0.304518 0.312822 0.204633 0.196896 -0.598254 -0.424024 -0.589185 0.427481 -0.393821 -0.373370 0.511021 -0.491858 -0.646807 -0.647015 0.251912 -0.212354 -0.674697 0.243534 0.243476 0.249778 0.230686 0.307988 0.236534 0.234025 0.219661 0.327444 0.231815 0.232146 0.214862 0.232832 0.216305 0.232376 0.227249 0.226522 0.211346 0.228606 0.228684
chargesum: 0.00000
title: Mulliken charges with hydrogens summed into heavy atoms:
elementType: O O N N C C C C C C C C C C C C C C C C C C
charge: -0.316129 -0.277922 -0.162290 -0.142007 -0.220966 0.304518 0.312822 0.204633 0.196896 -0.348476 -0.193337 -0.281198 0.427481 -0.157287 -0.139345 0.511021 -0.272196 0.032017 0.034498 0.251912 0.241417 -0.006061
polarizability: 4.58638420e+02 7.88760926e+00 2.11515856e+02 -3.05407236e-02 3.39755902e-02 1.07983797e+02
1716.lowfreq: -2.1057 -0.7868 -0.0007 0.0009 0.0013 9.4239 16.9047 33.6608 52.5843
frequency: 16.4988 33.4352 52.4979 55.0571 63.0739 68.9371 94.4838 112.0543 123.6032 143.0252 160.1651 166.8795 211.0092 216.2298 226.3195 243.0317 252.7200 285.5092 297.0240 327.1084 344.5655 377.0874 400.4541 427.5712 438.6501 441.8969 476.1569 530.5256 544.1156 553.9484 572.3303 605.5751 634.2936 639.3427 689.1839 695.9179 710.6713 713.2262 736.8694 759.3540 766.5548 799.8945 806.9802 821.8419 845.4996 851.5113 865.5619 908.9272 937.8257 938.3384 939.2523 958.7417 968.5415 979.8608 999.2030 1045.8071 1056.7387 1106.8492 1110.2257 1111.2369 1112.2106 1131.4074 1139.4630 1139.5908 1144.0432 1148.2557 1174.4118 1193.1158 1206.5857 1232.5312 1248.0526 1262.7159 1273.4622 1294.2692 1316.5932 1354.2633 1358.1893 1376.3030 1379.1806 1399.5585 1426.9231 1430.1796 1449.9690 1453.7242 1463.2230 1463.7343 1464.6742 1474.5899 1476.6237 1483.3991 1489.2339 1494.7828 1501.7115 1514.1681 1516.3646 1579.5967 1597.6498 1629.6836 1637.1291 1661.0210 2932.2885 2941.1527 2982.0790 2994.5096 2995.4582 2999.0684 3005.4242 3026.0038 3063.0878 3090.6116 3091.7652 3101.3039 3105.0404 3111.7071 3124.6420 3142.4367 3151.2069 3168.6856 3174.8212 3543.3835
redmass: 2.8881 3.1378 4.5909 4.3838 3.5264 3.2513 2.9655 2.1844 4.4559 3.4476 1.8126 5.2568 1.3161 4.1111 2.7836 1.8427 1.1900 4.9178 3.4416 4.2485 6.1011 3.6275 4.6996 2.7879 2.9825 3.6616 3.8773 4.0364 2.9214 4.8191 5.2129 2.7364 6.0397 1.3210 6.0899 5.3081 6.4079 3.0347 5.6071 3.3362 5.2608 1.0939 1.5018 1.6141 1.5091 3.5798 4.4828 1.5125 1.4071 4.2734 1.3675 2.7667 1.9575 3.5336 4.3891 3.4375 1.4897 2.6146 1.3058 1.2487 2.2439 1.1492 1.5610 1.7303 1.8354 1.5120 2.1823 1.6088 1.8225 1.6443 1.1336 2.8444 2.0446 1.4946 2.3475 1.4549 3.4112 5.7406 3.5115 1.2716 1.1305 1.1962 2.6592 1.8761 1.0407 1.0402 2.7912 1.0460 1.0646 2.4999 1.1234 1.2791 1.5657 1.4824 2.0555 6.8702 5.6920 7.1260 7.0222 8.6098 1.0369 1.0395 1.0608 1.0357 1.0995 1.1023 1.0579 1.0993 1.1069 1.0958 1.0986 1.0937 1.1025 1.0879 1.0894 1.0958 1.0903 1.0927 1.0928 1.0759
irintensity: 0.7646 0.4816 3.4993 1.2769 0.6296 1.2688 8.1091 0.0133 0.8689 3.1824 0.0617 4.4734 0.4865 1.6054 5.4781 7.6709 1.3777 10.8904 0.5960 1.1045 6.7398 8.3896 4.2776 9.1543 0.2308 1.3653 3.7020 1.8482 8.2054 0.9611 5.2618 0.9406 0.5298 37.6931 15.4554 49.4162 4.7736 5.3558 4.7900 0.1881 1.5207 3.4466 81.4234 33.5486 25.5399 1.2149 7.1278 3.5313 2.1294 40.8562 0.5615 31.1605 25.0045 103.2924 0.2917 296.8394 26.8818 67.1488 0.9943 0.1611 5.3358 0.0315 7.0859 6.5860 306.2607 22.2789 338.3521 13.1457 4.0734 5.8034 0.0526 31.2096 7.0576 60.4926 2.5502 25.3632 158.9847 3.8266 80.4015 28.7314 10.7370 14.9520 212.1462 16.5862 11.7635 0.3173 1.5177 20.3520 36.4932 305.7479 21.9865 44.5808 61.7057 35.0126 544.9509 50.5008 91.0545 1.6015 314.8861 271.2874 113.7913 158.4619 14.9928 27.3516 15.8364 82.6733 29.3086 8.2951 10.4436 4.2787 33.9528 55.8482 47.4273 29.3891 10.0158 21.1313 16.4399 27.5056 2.4271 32.7114
temp: 298.150 k
press: 1.00000 atm
elementType: 8 8 7 7 6 6 6 6 6 6 6 6 6 6 6 6 6 6 6 6 6 6 1 1 1 1 1 1 1 1 1 1 1 1 1 1 1 1 1 1 1 1
symmnumber: 1
zpe: 897779.7 jmol-1
zpe.correction: 0.341946 hartree
zpe.thermalcorrener: 0.362991 hartree
zpe.thermalcorrenthalpy: 0.363935 hartree
zpe.thermalcorrgfe: 0.290375 hartree
zpe.sumelectzpe: -956.305900 hartree
zpe.sumelectthermal: -956.284855 hartree
zpe.sumelectthermalent: -956.283911 hartree
zpe.sumelectthermalfe: -956.357471 hartree
dipole: -2.0361 0.5043 0.0072
dipole: 2.0976
quadrupole: -76.9877 -119.2993 -135.4460
quadrupole: 9.5261 0.0553 -0.0585
quadrupole: 33.5900 -8.7216 -24.8683 9.5261 0.0553 -0.0585
hfenergy: -956.6478458 hartree
pointgroup: C01 [X(C18H20N2O2)]
dipole: -0.8011742 -0.1974672 -0.014166 debye
polarizability: 458.623707|-8.0934789|211.3324922|0.8979536|4.4735116|108.181873 unknown
InChI: InChI=1S/C18H20N2O2/c1-4-22-18(21)19-14-5-7-16-12(10-14)9-13-11-15(20(2)3)6-8-17(13)16/h5-8,10-11,19H,4,9H2,1-3H3
charge 0 multiplicity 1
42 atoms
O  5.947635 -0.024761 0.009748
O  4.288726 1.651499 0.089694
N  -5.937101 0.676873 -0.003399
N  3.783711 -0.666845 -0.027905
C  -0.890828 1.442586 0.046181
C  -2.199231 0.656315 0.007962
C  0.170577 0.346966 0.003366
C  -1.919373 -0.743133 -0.049763
C  -0.46122 -0.934468 -0.053369
C  -3.512776 1.141044 0.023621
C  -2.993447 -1.658776 -0.091017
C  1.565723 0.483632 0.014233
C  -4.611842 0.218452 -0.01806
C  0.335224 -2.100791 -0.101139
C  -4.320244 -1.185872 -0.075133
C  2.359215 -0.697299 -0.033777
C  1.739828 -1.976745 -0.091204
C  -7.047087 -0.281294 -0.037059
C  -6.21605 2.115549 0.05099
C  4.613009 0.43805 0.029504
C  6.985345 1.040737 0.070947
C  8.338267 0.337539 0.017469
H  -0.804823 2.060455 0.961585
H  -0.798376 2.136801 -0.812069
H  -3.694309 2.219006 0.067734
H  -2.810064 -2.738822 -0.135487
H  2.053511 1.460032 0.058591
H  -0.121138 -3.095746 -0.145767
H  -5.137386 -1.911608 -0.108217
H  2.365389 -2.878066 -0.127944
H  4.26972 -1.56509 -0.070556
H  -7.034772 -0.898232 -0.959488
H  -7.024843 -0.97068 0.832218
H  -8.003469 0.264564 -0.009637
H  -5.792008 2.652279 -0.822872
H  -7.30549 2.27878 0.050443
H  -5.803116 2.5836 0.968798
H  6.834759 1.729194 -0.780509
H  6.846262 1.614634 1.005321
H  9.150389 1.086119 0.059047
H  8.458125 -0.352742 0.870116
H  8.445477 -0.239936 -0.916803
