program: Gaussian 09
title: 000256432
version: EM64L-G09RevD.01
frameworkgroup: C1[X(C14H8BrNO3)]
method: RPBEPBE
basis: SDD
operation: Freq
keyword: #p
keyword: freq=noraman
keyword: PBEPBE/SDD
title: #p freq=noraman PBEPBE/SDD
converged: YES YES YES YES
title: Mulliken charges:
elementType: Br O O O N C C C C C C C C C C C C C C H H H H H H H H
charge: 0.028228 -0.242971 -0.191662 -0.233338 -0.411816 0.310759 0.321579 0.195245 0.065675 -0.327346 -0.504430 0.706710 -0.360925 0.060066 -0.608552 -0.348936 -0.231502 -0.234152 -0.058971 0.243985 0.346654 0.227708 0.278741 0.236403 0.242265 0.310680 0.179903
chargesum: 0.00000
title: Mulliken charges with hydrogens summed into heavy atoms:
elementType: Br O O O N C C C C C C C C C C C C C C
charge: 0.028228 -0.242971 -0.191662 -0.233338 -0.101136 0.310759 0.321579 0.195245 0.065675 -0.083361 -0.157777 0.706710 -0.133216 0.060066 -0.608552 -0.070195 0.004901 0.008113 0.120932
polarizability: 3.28591143e+02 -1.75419315e+01 2.22536360e+02 7.82285985e-03 1.43650989e-02 6.63649080e+01
1716.lowfreq: -0.0006 -0.0002 0.0008 3.1839 5.0019 9.1069 36.1307 60.0570 85.6984
frequency: 36.0550 60.0478 85.6959 114.0947 118.5324 134.4809 144.7602 189.6578 214.9228 234.3763 251.2014 302.4160 325.6685 349.4813 396.9749 429.1626 434.3814 451.8351 454.9826 491.4167 526.6138 569.2526 614.0225 658.1198 659.2683 669.1150 689.9139 698.9635 717.7851 735.2692 770.1652 785.5605 802.2077 830.5594 873.9898 890.9068 931.0866 936.8175 954.0257 979.8596 980.2303 1003.6970 1007.0270 1051.1659 1095.6096 1108.2396 1163.3905 1181.0209 1209.5926 1227.3496 1251.6324 1274.9843 1317.4045 1360.2862 1385.6809 1390.1025 1413.3546 1444.6031 1446.0686 1489.9657 1513.8819 1557.1338 1582.4769 1612.9803 1615.6677 1641.1334 1673.1294 2950.5883 3137.1641 3150.9219 3161.1176 3173.9808 3175.8713 3192.7147 3466.8562
redmass: 9.1116 7.9126 5.2833 9.2788 5.6723 10.5764 5.7430 4.5833 9.9294 15.4667 4.5331 8.8667 4.6718 7.7537 4.4310 3.9381 7.7017 7.8290 3.0819 9.1792 3.9211 7.8506 6.9827 4.1365 7.2840 3.2787 6.6432 1.5918 7.4849 2.6331 3.5704 1.5047 7.7328 7.2284 1.6252 1.4276 1.4718 7.2020 1.5582 4.9174 1.3812 7.4190 1.3466 2.1050 2.4206 2.3284 2.9291 1.0897 1.9341 4.0564 1.3000 1.8583 2.4257 2.2530 8.1625 1.6339 6.1279 2.7813 2.5888 2.4308 4.3628 4.3317 7.2725 7.1229 6.6274 5.0041 12.2679 1.0873 1.0860 1.0895 1.0951 1.0950 1.0965 1.0933 1.0770
irintensity: 0.6959 0.7429 13.8220 1.0021 0.6143 5.5277 0.0012 6.5293 3.0769 0.3894 1.5404 11.3914 12.7427 1.6848 2.3952 0.0315 3.4015 2.0340 8.9354 2.1188 3.3003 9.9169 3.2947 21.3654 14.0609 2.2534 2.9025 82.1084 2.7263 2.5182 20.5139 57.6885 40.5828 8.2502 8.1778 0.3296 41.5188 135.1290 7.4614 85.5508 2.1642 11.9767 0.2459 0.2805 33.0230 44.5849 133.9197 3.0682 6.1689 23.9124 23.4527 1.8358 80.5407 71.3829 20.0286 68.5142 39.0573 72.6639 70.9923 245.7326 162.9831 138.0283 14.8929 212.9060 29.7663 156.9146 394.4074 123.4266 3.4497 8.2941 8.2264 6.8697 16.0987 20.3916 55.9492
temp: 298.150 k
press: 1.00000 atm
elementType: 35 8 8 8 7 6 6 6 6 6 6 6 6 6 6 6 6 6 6 1 1 1 1 1 1 1 1
symmnumber: 1
zpe: 489994.4 jmol-1
zpe.correction: 0.186629 hartree
zpe.thermalcorrener: 0.201871 hartree
zpe.thermalcorrenthalpy: 0.202816 hartree
zpe.thermalcorrgfe: 0.142812 hartree
zpe.sumelectzpe: -830.907259 hartree
zpe.sumelectthermal: -830.892017 hartree
zpe.sumelectthermalent: -830.891073 hartree
zpe.sumelectthermalfe: -830.951076 hartree
dipole: -1.6686 -7.1457 -0.0004
dipole: 7.3379
quadrupole: -96.8272 -135.3064 -121.2617
quadrupole: -13.9501 0.0006 -0.0002
quadrupole: 20.9712 -17.5080 -3.4632 -13.9501 0.0006 -0.0002
hfenergy: -831.0938881 hartree
pointgroup: C01 [X(C14H8Br1N1O3)]
dipole: 0.0907306 -2.8855274 -0.0001651 debye
polarizability: 330.2795557|11.2162576|220.847948|0.0038537|0.0158966|66.364908 unknown
InChI: InChI=1S/C14H8BrNO3/c15-11-5-10-8-3-1-2-4-9(8)14(18)19-13(10)6-12(11)16-7-17/h1-7,16H
charge 0 multiplicity 1
27 atoms
Br -3.049346 -3.230843 -0.000222
O  0.338407 1.904556 0.00043
O  2.320936 3.049026 0.000386
O  -4.427994 2.095862 0.000222
N  -4.016242 -0.234804 0.000043
C  0.264369 -0.565656 0.000164
C  1.731782 -0.615504 0.00017
C  -0.384586 0.700024 0.000265
C  2.4589 0.617578 0.000325
C  -0.572602 -1.714273 0.000015
C  -1.782722 0.844403 0.000223
C  -2.605821 -0.307727 0.000084
C  2.472438 -1.830229 -0.000008
C  1.775192 1.930997 0.00058
C  -1.963786 -1.586822 -0.000018
C  3.878609 0.621358 0.000264
C  3.878098 -1.817661 -0.000051
C  4.590116 -0.589488 0.000083
C  -4.824794 0.902535 0.000132
H  -0.133909 -2.714673 -0.000079
H  -2.233403 1.838284 0.000306
H  1.951638 -2.792601 -0.000133
H  4.392156 1.587954 0.000386
H  4.427218 -2.765462 -0.000197
H  5.684636 -0.587424 0.000049
H  -4.5037 -1.13817 -0.000063
H  -5.902591 0.624558 0.000042
