program: Gaussian 09
title: 000264488
version: EM64L-G09RevD.01
frameworkgroup: C1[X(C26H20)]
method: RPBEPBE
basis: SDD
operation: Freq
keyword: #p
keyword: freq=noraman
keyword: PBEPBE/SDD
title: #p freq=noraman PBEPBE/SDD
converged: YES YES NO NO
title: Mulliken charges:
elementType: C C C C C C C C C C C C C C C C C C C C C C C C C C H H H H H H H H H H H H H H H H H H H H
charge: 0.015927 0.263361 0.316611 0.197890 0.502237 0.134713 0.124732 -0.804392 0.426026 -0.441755 0.309287 -0.514152 -0.382424 -0.536441 -0.483007 -0.347769 0.446509 -0.444648 -0.415034 -0.261303 -0.250873 -0.850995 -0.405688 -0.262691 -0.252485 -0.817369 0.232358 0.264291 0.232863 0.263753 0.256711 0.247061 0.222002 0.241207 0.230874 0.227670 0.228457 0.246647 0.223040 0.247385 0.228473 0.227091 0.229017 0.227629 0.234648 0.222557
chargesum: 0.00000
title: Mulliken charges with hydrogens summed into heavy atoms:
elementType: C C C C C C C C C C C C C C C C C C C C C C C C C C
charge: 0.015927 0.263361 0.316611 0.197890 0.502237 0.134713 0.124732 -0.572034 0.426026 -0.177464 0.309287 -0.281289 -0.118671 -0.279730 -0.235947 -0.125768 0.446509 -0.203441 -0.184160 -0.033633 -0.022416 -0.133922 -0.177215 -0.035600 -0.023468 -0.132535
polarizability: 4.25692016e+02 -3.58285264e+01 3.39528595e+02 -8.70810764e-01 -4.02052436e+00 1.70191659e+02
1716.lowfreq: -9.4458 -3.9842 -0.0006 -0.0005 0.0005 4.2378 6.2373 30.8709 39.6781
frequency: -3.5703 30.8572 39.6633 53.2774 64.8825 74.4724 93.8017 128.9648 133.4739 146.9328 167.4153 208.7306 223.1816 226.6162 284.5390 296.5516 306.4646 324.1542 334.1604 365.3564 403.8355 422.5645 446.5281 449.3169 452.6379 459.6269 503.6164 517.3815 532.6535 534.0318 570.7124 575.2694 603.2467 625.7523 634.2243 648.0068 670.9097 706.7883 729.7338 736.4668 752.8233 759.1652 762.1916 783.4062 790.1836 814.3506 814.4798 827.8263 856.2504 868.1681 870.2732 889.6828 893.8931 907.7662 933.9119 935.9235 956.7451 959.9250 971.1218 976.5513 986.0308 992.9243 994.9906 1003.9814 1010.4411 1024.4774 1041.4775 1044.9846 1048.7966 1094.0219 1109.2450 1145.6995 1158.7523 1170.1192 1175.8923 1179.7656 1217.9562 1218.8295 1233.6692 1235.5923 1251.8088 1266.7861 1279.6480 1283.5244 1326.4148 1344.3095 1359.6160 1371.0780 1392.7421 1396.0254 1399.6375 1400.8913 1410.5960 1414.6755 1435.1427 1442.7709 1456.9827 1463.7612 1467.9067 1472.4729 1478.9066 1482.9444 1497.0190 1505.2695 1543.4514 1568.1828 1579.5919 1588.0572 1616.4173 1618.8315 1621.7821 1630.3716 2972.8946 2975.2335 3052.9779 3053.9386 3080.6619 3082.4482 3111.3697 3117.8679 3118.7298 3120.4274 3123.2087 3130.6351 3131.1795 3136.4184 3138.6362 3147.6726 3150.5129 3155.3932 3162.0517 3164.4836
redmass: 3.7028 1.0210 4.3922 5.0085 4.4439 4.0335 1.1047 2.5020 4.0498 4.9463 4.0723 4.6146 4.1843 4.1106 4.6318 3.2220 3.5233 3.4815 5.1510 4.9304 3.1392 3.0158 5.0672 3.2401 3.2657 4.1103 4.9770 3.4728 5.3277 3.4234 2.8841 6.6641 4.6839 5.4239 4.8395 6.1532 6.6482 3.2682 3.9206 3.5024 5.2999 1.3512 1.3231 5.7252 2.7283 1.9761 2.3712 1.5596 1.8677 3.4583 1.6273 1.7865 4.2846 1.5367 2.3980 3.1152 1.3917 1.3783 1.4271 2.0957 1.3368 1.3417 1.3932 2.3457 1.4822 2.2290 2.1781 1.5568 1.5447 2.5245 2.3665 1.5069 1.3147 1.2969 1.1985 1.1775 1.7124 1.8056 2.8232 2.0040 1.7167 1.8480 1.7017 1.6949 2.4725 3.1266 6.7594 3.1522 4.0632 1.2954 2.2529 1.3762 2.8593 2.6848 3.3496 4.6651 2.7405 1.0466 1.1080 1.0543 1.1245 2.8325 3.2953 3.5262 6.6024 7.3964 5.8360 5.7390 6.2430 6.4123 6.4535 6.6539 1.0384 1.0369 1.0972 1.0951 1.0994 1.0998 1.0869 1.0915 1.0863 1.0867 1.0872 1.0887 1.0885 1.0968 1.0910 1.0944 1.0926 1.0961 1.1003 1.0995
irintensity: 0.0036 0.5852 0.2062 0.3004 0.5352 0.0125 0.5204 0.6162 0.0421 0.2724 1.5326 0.3907 0.5467 1.0665 0.0200 2.1505 2.8457 0.0938 0.6065 0.2271 1.2662 3.3166 1.5531 5.6521 5.5534 2.3417 1.6936 0.3363 2.7167 12.2041 3.1076 6.1624 2.8745 2.9187 2.2346 1.9416 2.4849 5.6820 2.3431 4.2895 0.4709 16.9457 93.0533 4.2238 10.6512 4.1637 8.2379 17.5943 39.5451 5.8238 19.4989 5.5800 1.3198 1.4317 12.4575 4.8178 3.4979 0.4022 5.3160 4.9875 0.3391 0.2224 1.6518 2.2613 0.3584 10.2629 8.3440 1.8264 18.2636 3.8231 1.8044 9.2078 1.7339 1.5869 2.5197 0.5752 0.7151 0.9661 2.3204 9.0846 10.3044 0.6173 0.8986 2.9416 1.4447 6.7056 0.8233 3.4882 2.4012 7.9012 5.6720 13.4333 4.0303 10.2163 0.2864 5.9151 2.8545 12.7694 0.4349 11.9308 27.2644 8.8108 27.0690 24.6849 1.7184 2.8980 2.1660 1.5496 0.9762 6.4015 0.1783 0.4283 44.7816 21.8908 10.1919 20.4202 30.2952 20.0258 11.7215 13.9689 1.3052 0.8076 7.5688 1.2366 15.5065 37.3570 5.7938 21.3132 29.5463 23.3237 46.4182 39.5613
temp: 298.150 k
press: 1.00000 atm
elementType: 6 6 6 6 6 6 6 6 6 6 6 6 6 6 6 6 6 6 6 6 6 6 6 6 6 6 1 1 1 1 1 1 1 1 1 1 1 1 1 1 1 1 1 1 1 1
symmnumber: 1
zpe: 972764.0 jmol-1
zpe.correction: 0.370506 hartree
zpe.thermalcorrener: 0.390679 hartree
zpe.thermalcorrenthalpy: 0.391623 hartree
zpe.thermalcorrgfe: 0.321499 hartree
zpe.sumelectzpe: -1001.071074 hartree
zpe.sumelectthermal: -1001.050901 hartree
zpe.sumelectthermalent: -1001.049956 hartree
zpe.sumelectthermalfe: -1001.120081 hartree
dipole: -0.3061 -0.2232 -0.0041
dipole: 0.3788
quadrupole: -132.8623 -135.9411 -153.3131
quadrupole: 3.4889 -0.2678 -0.6121
quadrupole: 7.8432 4.7644 -12.6076 3.4889 -0.2678 -0.6121
hfenergy: -1001.4415799 hartree
pointgroup: C01 [X(C26H20)]
dipole: -0.1153196 -0.0943694 -0.0033139 debye
polarizability: 429.4192019|-30.7851286|335.8781266|0.2654106|-2.2497802|170.1149415 unknown
InChI: InChI=1S/C26H20/c1-17-11-12-18(2)24(15-17)26-22-10-6-4-8-20(22)16-25-21-9-5-3-7-19(21)13-14-23(25)26/h3-16H,1-2H3
charge 0 multiplicity 1
46 atoms
C  -0.783075 0.203933 0.031247
C  0.534317 -0.337412 0.018204
C  1.696611 0.539132 -0.073937
C  -0.980088 1.620482 -0.043622
C  0.179223 2.493199 -0.133077
C  -1.976592 -0.709034 0.119449
C  3.046869 -0.051735 -0.086623
C  1.482606 1.92921 -0.146554
C  3.191649 -1.481568 0.000729
C  0.744633 -1.77184 0.103013
C  -2.522115 -1.084147 1.384342
C  2.010378 -2.316147 0.096502
C  -2.289627 2.22058 -0.028286
C  -2.570587 -1.192052 -1.072758
C  -0.018833 3.91631 -0.2056
C  4.234368 0.733929 -0.182078
C  -3.699102 -2.049541 -1.059079
C  4.492862 -2.067733 -0.009269
C  -3.653226 -1.937778 1.396519
C  -2.445967 3.603567 -0.097325
C  -1.299558 4.463024 -0.187609
C  -1.914625 -0.585188 2.683596
C  -4.235451 -2.413294 0.200978
C  5.507305 0.141654 -0.191014
C  5.64231 -1.271429 -0.10385
C  -4.295657 -2.577815 -2.352507
H  2.330348 2.618924 -0.214635
H  -0.135655 -2.41866 0.169065
H  2.147674 -3.402278 0.161555
H  -3.166298 1.567679 0.034132
H  -2.136786 -0.887242 -2.033516
H  0.861887 4.566247 -0.274682
H  4.166952 1.823919 -0.250877
H  4.579852 -3.158887 0.057675
H  -4.085359 -2.230481 2.361487
H  -3.449131 4.044195 -0.084231
H  -1.440123 5.548176 -0.242441
H  -1.926224 0.519613 2.737551
H  -2.467232 -0.976345 3.555364
H  -0.85706 -0.894713 2.781024
H  -5.113042 -3.070207 0.247358
H  6.4005 0.771785 -0.265716
H  6.637003 -1.730146 -0.111508
H  -4.182375 -1.851455 -3.176763
H  -3.795422 -3.513705 -2.669868
H  -5.371035 -2.802725 -2.239161
