program: Gaussian 09
title: 000264494
version: EM64L-G09RevD.01
frameworkgroup: C1[X(C27H22)]
method: RPBEPBE
basis: SDD
operation: Freq
keyword: #p
keyword: freq=noraman
keyword: PBEPBE/SDD
title: #p freq=noraman PBEPBE/SDD
converged: YES YES NO NO
title: Mulliken charges:
elementType: C C C C C C C C C C C C C C C C C C C C C C C C C C C H H H H H H H H H H H H H H H H H H H H H H
charge: 0.036466 0.266853 0.323182 0.007845 0.193477 0.507789 0.125234 -0.810553 0.345258 0.345270 -0.455920 0.423054 -0.516469 -0.392030 -0.628760 -0.628860 -0.484504 0.477532 -0.348997 -0.858020 -0.858022 -0.444929 -0.261116 -0.251970 -0.262623 -0.252814 -0.819226 0.232834 0.268447 0.233282 0.266634 0.237356 0.237358 0.247279 0.222326 0.247185 0.248194 0.225561 0.247176 0.225562 0.248203 0.241550 0.227718 0.228556 0.227166 0.229085 0.233786 0.223797 0.223798
chargesum: 0.00000
title: Mulliken charges with hydrogens summed into heavy atoms:
elementType: C C C C C C C C C C C C C C C C C C C C C C C C C C C
charge: 0.036466 0.266853 0.323182 0.007845 0.193477 0.507789 0.125234 -0.577719 0.345258 0.345270 -0.187473 0.423054 -0.283187 -0.125395 -0.391405 -0.391502 -0.237224 0.477532 -0.126671 -0.137081 -0.137081 -0.203379 -0.033397 -0.023414 -0.035457 -0.023729 -0.137845
polarizability: 4.41672731e+02 3.52105348e+01 3.53246212e+02 6.45837131e-03 -4.30766329e-03 1.76769557e+02
1716.lowfreq: -7.6818 -4.4114 -0.0010 -0.0005 0.0008 6.7134 18.9346 41.1457 41.1934
frequency: 18.3767 41.0994 41.1766 58.3156 65.4019 77.3042 107.1391 117.1087 123.4410 133.4964 145.6489 169.4206 188.3691 204.3079 225.8974 227.3234 268.5564 287.1908 300.9290 312.3424 331.0948 349.6742 384.3325 417.1651 434.7910 445.6106 482.9978 506.3723 514.0284 518.7472 522.9629 530.8022 541.8215 546.8901 564.4499 572.2799 582.4093 599.2504 644.3524 647.6026 651.5998 709.1101 737.9952 754.4333 759.3427 763.2386 790.5933 804.9275 814.2995 824.3526 856.5118 866.3904 869.7948 875.0193 890.3365 895.8665 916.8702 928.3842 939.6426 953.0554 957.6126 972.0977 980.7457 986.2034 994.5300 995.7265 1016.7748 1017.1118 1022.9426 1040.1132 1040.9764 1043.3502 1046.0469 1050.2636 1095.6569 1116.1162 1153.5014 1166.1462 1174.1217 1178.6245 1203.5291 1218.0797 1234.5663 1248.5338 1252.3149 1264.0041 1280.1501 1313.0381 1326.2432 1347.4163 1353.2716 1370.6975 1393.1497 1395.9363 1397.4407 1399.3712 1404.6148 1413.2812 1413.6343 1434.8477 1435.9391 1453.5231 1457.1244 1464.3994 1464.9459 1472.6866 1473.7329 1480.4064 1483.3277 1497.3122 1504.8378 1543.1870 1568.2333 1577.8419 1587.5714 1616.4563 1618.8790 1621.3113 1629.4742 2971.9606 2975.8675 2976.5154 3052.9932 3054.3193 3054.4516 3081.2672 3081.6514 3081.7375 3108.9951 3113.3479 3118.2508 3120.4915 3122.4493 3129.9354 3131.3834 3138.8763 3145.7640 3151.1073 3151.6184 3161.1221 3164.9575
redmass: 3.8073 4.3325 4.2501 1.0110 4.3835 4.1357 2.0222 1.0508 1.3543 4.1162 4.4667 4.0476 3.0152 4.8969 3.9951 3.0125 2.5199 4.6309 3.1895 3.5818 5.2155 4.7761 5.1650 3.1424 3.1803 5.0997 2.7769 5.9080 3.9363 3.6941 3.1479 5.7223 3.6111 4.9544 4.3247 2.8771 6.5563 3.7343 6.3202 4.1388 5.8914 3.1543 4.0771 5.3979 1.2952 1.3141 2.7665 5.8295 1.6979 5.4380 1.8987 1.3216 1.4767 4.0861 1.7561 1.3097 5.8200 2.2946 2.3401 3.5119 1.3943 1.4164 5.5734 1.3334 1.3319 1.3696 1.6792 1.5878 2.2184 1.7903 2.1544 1.5693 1.5273 1.6093 2.4816 2.4500 1.4907 1.3888 1.1460 1.0949 1.6225 1.7707 1.7761 1.7309 1.4405 1.7849 2.0528 5.2888 2.5952 3.5645 6.9689 3.0584 4.7954 1.2270 1.3182 1.2399 2.7247 2.3729 2.4460 4.4873 3.0097 2.1636 2.5604 1.0487 1.0457 1.0771 1.0543 1.1793 2.1248 2.1025 3.4598 6.5867 7.4961 7.0545 5.6580 6.2147 5.9569 6.4183 6.6616 1.0384 1.0368 1.0369 1.0951 1.0971 1.0971 1.0995 1.0997 1.0994 1.0908 1.0917 1.0862 1.0869 1.0865 1.0882 1.0887 1.0910 1.0946 1.0944 1.0949 1.1004 1.0993
irintensity: 0.0005 0.1903 0.1549 0.3962 0.4562 0.0513 0.8745 0.0315 0.1889 0.0126 0.1956 1.6920 3.6832 0.5725 0.1928 0.0117 0.6673 0.0036 3.2057 2.5902 0.2609 0.1512 1.0477 5.5772 0.2880 2.8891 4.1095 0.4534 0.2092 1.4935 1.0186 1.0240 10.0626 5.9739 0.7699 2.3713 4.5241 2.4030 1.6968 0.8807 4.0481 7.3161 1.1359 1.3313 15.9390 94.1907 10.4217 6.2513 0.1273 0.5760 42.6023 16.5023 13.8781 7.9124 4.4539 0.0086 5.7935 14.6533 2.2872 0.3070 3.7224 5.6837 3.1007 0.3017 0.0762 1.1275 15.8686 1.9610 11.2984 0.0320 9.2671 1.3833 0.0013 25.5171 3.9239 0.6055 2.8496 2.3876 1.7928 1.0779 6.9385 0.3162 5.3814 10.9516 0.0037 1.3419 1.9865 0.3835 1.0630 5.1605 0.1463 3.2988 6.0023 9.9069 25.1849 0.7262 0.3771 1.3140 6.5612 0.1145 0.3349 10.9205 6.1891 26.5714 0.0405 4.2135 12.3033 30.1528 6.3866 30.4398 21.1779 1.6229 2.5086 12.7442 1.6846 0.5866 23.5200 1.0088 0.4263 50.3739 42.4184 2.7700 18.4208 0.0021 22.3224 5.8241 31.3670 40.3039 29.0725 23.2838 1.2867 0.2340 7.3505 2.5826 12.9678 5.4558 22.4265 3.4860 47.8350 47.1536 41.3753
temp: 298.150 k
press: 1.00000 atm
elementType: 6 6 6 6 6 6 6 6 6 6 6 6 6 6 6 6 6 6 6 6 6 6 6 6 6 6 6 1 1 1 1 1 1 1 1 1 1 1 1 1 1 1 1 1 1 1 1 1 1
symmnumber: 1
zpe: 1044371.5 jmol-1
zpe.correction: 0.397780 hartree
zpe.thermalcorrener: 0.420486 hartree
zpe.thermalcorrenthalpy: 0.421430 hartree
zpe.thermalcorrgfe: 0.345276 hartree
zpe.sumelectzpe: -1040.299868 hartree
zpe.sumelectthermal: -1040.277162 hartree
zpe.sumelectthermalent: -1040.276218 hartree
zpe.sumelectthermalfe: -1040.352371 hartree
dipole: 0.3190 -0.0690 0.0001
dipole: 0.3264
quadrupole: -138.0121 -143.1872 -160.3243
quadrupole: -2.8657 0.0016 -0.0002
quadrupole: 9.1624 3.9873 -13.1497 -2.8657 0.0016 -0.0002
hfenergy: -1040.6976477 hartree
pointgroup: C01 [X(C27H22)]
dipole: -0.1235902 -0.0348125 -0.0000321 debye
polarizability: 445.6686261|-29.5037544|349.2503168|0.0061806|0.0046975|176.7695569 unknown
InChI: InChI=1S/C27H22/c1-17-14-18(2)26(19(3)15-17)27-23-11-7-5-9-21(23)16-25-22-10-6-4-8-20(22)12-13-24(25)27/h4-16H,1-3H3
charge 0 multiplicity 1
49 atoms
C  -0.640612 0.296688 -0.000033
C  0.641317 -0.323869 -0.000055
C  1.858379 0.480094 0.000008
C  -1.892821 -0.539219 -0.000088
C  -0.744491 1.725218 0.000045
C  0.46807 2.526879 0.000102
C  3.168847 -0.194824 -0.00001
C  1.734157 1.883106 0.000084
C  -2.491268 -0.930553 -1.234899
C  -2.491118 -0.930944 1.234667
C  0.758454 -1.771239 -0.000146
C  3.220863 -1.633909 -0.000094
C  1.987082 -2.395062 -0.000165
C  -2.014521 2.404875 0.000074
C  -3.677348 -1.703884 -1.213833
C  -3.677207 -1.704265 1.213497
C  0.360078 3.961506 0.000181
C  -4.29078 -2.097942 -0.000192
C  4.40571 0.51693 0.000055
C  -1.867867 -0.531564 -2.561979
C  -1.867548 -0.532401 2.561802
C  4.482512 -2.300998 -0.00011
C  -2.084087 3.796668 0.000151
C  -0.884776 4.586009 0.000203
C  5.63872 -0.154491 0.000039
C  5.682023 -1.576063 -0.000044
C  -5.581209 -2.899519 -0.00025
H  2.624937 2.519906 0.000131
H  -0.163688 -2.361317 -0.000208
H  2.054076 -3.489712 -0.000235
H  -2.93027 1.80425 0.00004
H  -4.130756 -2.004528 -2.167373
H  -4.130508 -2.005201 2.166996
H  1.280735 4.55751 0.000224
H  4.408403 1.61106 0.000119
H  -1.798721 0.567866 -2.661855
H  -0.837636 -0.922442 -2.658835
H  -2.4606 -0.915761 -3.409937
H  -1.797893 0.56698 2.66182
H  -2.460456 -0.916445 3.409707
H  -0.837496 -0.923771 2.658613
H  4.498879 -3.397525 -0.000174
H  -3.058266 4.298376 0.000173
H  -0.956858 5.679238 0.000263
H  6.571676 0.419999 0.00009
H  6.645787 -2.096711 -0.000056
H  -6.465056 -2.231733 -0.000606
H  -5.657654 -3.543154 0.894053
H  -5.657293 -3.543607 -0.894263
