program: Gaussian 09
title: 000264496
version: EM64L-G09RevD.01
frameworkgroup: C1[X(C28H17Br)]
method: RPBEPBE
basis: SDD
operation: Freq
keyword: #p
keyword: freq=noraman
keyword: PBEPBE/SDD
title: #p freq=noraman PBEPBE/SDD
converged: YES YES NO NO
title: Mulliken charges:
elementType: Br C C C C C C C C C C C C C C C C C C C C C C C C C C C C H H H H H H H H H H H H H H H H H
charge: 0.007054 -0.001303 0.273575 0.307375 0.205096 0.154389 0.495558 0.127020 -0.802839 0.425617 -0.429977 0.251091 -0.515156 -0.371815 0.516754 -0.409815 -0.480368 -0.347927 -0.443619 -0.382978 -0.261189 -0.502917 -0.225838 -0.250090 -0.261490 -0.421255 -0.251596 -0.262363 -0.254478 0.234169 0.259169 0.234802 0.258142 0.263044 0.248063 0.222333 0.242855 0.262939 0.229751 0.251372 0.230240 0.228218 0.252174 0.230406 0.232111 0.233694
chargesum: 0.00000
title: Mulliken charges with hydrogens summed into heavy atoms:
elementType: Br C C C C C C C C C C C C C C C C C C C C C C C C C C C C
charge: 0.007054 -0.001303 0.273575 0.307375 0.205096 0.154389 0.495558 0.127020 -0.568670 0.425617 -0.170807 0.251091 -0.280355 -0.113672 0.516754 -0.146771 -0.232305 -0.125594 -0.200764 -0.120039 -0.031438 -0.502917 0.025534 -0.019850 -0.033271 -0.169081 -0.021190 -0.030252 -0.020784
polarizability: 4.74449414e+02 3.48621512e+01 3.74514924e+02 -2.67398505e+00 -1.95491998e+00 2.26217097e+02
1716.lowfreq: -1.6088 -0.0005 0.0003 0.0006 6.2423 7.4025 11.3386 28.4563 38.6133
frequency: 8.5438 28.2657 38.5271 67.1257 73.7301 101.2645 123.7436 128.9696 137.2411 164.4871 168.8671 187.7970 191.7348 218.8808 284.5274 297.2564 310.0407 329.3131 346.6482 373.8030 412.2671 420.1968 427.4842 446.4269 463.5994 467.8902 507.9612 514.6593 518.1794 520.8704 538.2967 546.2162 571.9770 578.0069 601.8036 631.0561 640.2994 645.3037 656.3513 664.9258 707.2847 747.2573 759.4255 763.1493 769.6971 779.7621 784.9701 787.5579 790.1693 812.5990 815.2014 841.5305 854.4934 865.8172 872.5930 885.8342 889.9192 890.8931 920.4110 936.4846 951.9091 958.0244 967.1994 971.5067 973.7555 985.9041 993.9792 994.4890 999.8452 1024.7676 1027.4808 1039.3676 1046.9663 1100.3180 1115.2433 1135.8592 1156.3775 1166.2955 1175.1912 1175.8352 1179.5815 1197.0673 1218.8634 1225.2268 1236.0793 1251.4371 1261.8196 1268.7711 1282.9930 1326.8262 1343.0971 1345.7983 1370.1836 1378.6841 1394.3431 1395.2693 1407.0518 1414.6977 1427.9076 1435.7756 1439.7678 1449.4293 1457.4229 1485.4135 1505.1076 1510.4456 1544.1414 1568.6673 1572.5073 1584.2020 1588.6555 1617.2229 1621.8426 1623.1444 1630.8654 3120.1738 3121.4929 3125.1679 3131.8472 3131.9891 3132.8379 3139.7136 3142.3294 3143.1039 3149.2086 3151.4038 3156.7702 3157.9479 3163.7353 3165.3103 3169.0343 3171.1663
redmass: 5.9236 8.8217 5.5066 4.4757 4.5647 5.2102 5.6864 4.5772 4.9601 4.6645 6.9483 5.4546 6.0296 4.7284 4.8191 4.9557 4.6616 5.6723 5.9929 5.3433 3.6155 3.3415 3.3610 5.0761 3.5040 3.4050 6.1172 5.2071 3.8443 7.2524 3.6907 6.0428 2.8892 7.0357 3.7296 6.6523 4.5072 5.6889 5.0107 4.8440 3.1485 5.5609 1.3116 1.3197 4.7394 1.6331 5.1422 3.1486 2.8256 2.0611 2.0937 1.6687 1.9904 3.2356 1.6790 4.5114 1.7605 1.8377 5.3205 2.1974 1.4880 1.3870 4.0911 1.4361 1.4450 1.3439 1.3374 1.3765 1.3345 2.2746 2.8547 2.5397 2.6060 2.2556 2.2102 1.7635 1.4271 1.3640 1.1326 1.1288 1.0947 1.6547 1.6549 2.0568 1.7857 1.7019 1.5777 1.8263 1.9974 2.4296 3.8479 2.4587 2.8854 2.7073 5.4922 4.8361 2.6603 2.4834 3.1559 3.5360 3.7125 3.1065 2.7683 3.0261 3.4611 4.0578 6.6160 7.4539 7.7941 6.5041 5.6794 6.2270 6.3887 6.4631 6.6522 1.0866 1.0868 1.0875 1.0853 1.0888 1.0883 1.0911 1.0899 1.0890 1.0944 1.0927 1.0950 1.0960 1.1003 1.0995 1.1002 1.0956
irintensity: 0.0255 0.0027 0.0798 0.3100 0.1572 0.1781 0.1615 0.0984 0.3015 1.7430 1.1562 2.0823 1.2651 0.4207 0.2192 1.3589 1.8232 0.3822 4.0916 2.5705 3.4827 6.7998 1.5502 3.1899 7.7132 1.0746 0.4922 2.7581 1.5036 7.4299 10.4006 2.9390 2.6926 5.3383 0.5170 3.7941 0.4522 3.7262 4.4140 2.5033 6.5703 0.7900 6.7606 101.9684 2.1325 54.9907 5.5613 5.4416 7.5286 16.5570 12.5435 15.9100 37.4088 8.2896 17.7860 37.6867 2.6327 11.0302 40.7595 12.6506 3.4458 3.0124 11.5489 5.1627 1.0676 1.1744 0.2979 1.2492 0.1974 10.4248 10.0504 6.3097 3.0717 2.7672 10.1974 6.9495 3.6415 0.9060 4.4282 4.2950 1.3689 22.4091 1.5794 4.7661 5.4605 8.9611 13.3557 0.2983 1.2808 1.9988 3.5542 33.6153 17.4908 22.4894 0.5091 3.5737 1.2092 5.7598 6.9777 0.8286 2.6276 2.3708 1.7191 10.5336 22.2743 20.5806 1.8933 1.1669 21.3311 0.8441 1.3723 0.8452 0.4335 0.1987 0.1631 1.7815 1.3010 5.7315 1.3838 6.0066 7.8786 5.9335 6.3435 9.4375 22.5824 30.0858 15.6280 19.5059 44.9840 37.9065 28.7849 1.8353
temp: 298.150 k
press: 1.00000 atm
elementType: 35 6 6 6 6 6 6 6 6 6 6 6 6 6 6 6 6 6 6 6 6 6 6 6 6 6 6 6 6 1 1 1 1 1 1 1 1 1 1 1 1 1 1 1 1 1
symmnumber: 1
zpe: 926049.8 jmol-1
zpe.correction: 0.352714 hartree
zpe.thermalcorrener: 0.374296 hartree
zpe.thermalcorrenthalpy: 0.375240 hartree
zpe.thermalcorrgfe: 0.299998 hartree
zpe.sumelectzpe: -1088.786708 hartree
zpe.sumelectthermal: -1088.765125 hartree
zpe.sumelectthermalent: -1088.764181 hartree
zpe.sumelectthermalfe: -1088.839423 hartree
dipole: -2.0687 0.5473 0.7584
dipole: 2.2703
quadrupole: -164.9042 -162.4423 -172.2410
quadrupole: 0.3342 2.6211 -0.5545
quadrupole: 1.6250 4.0869 -5.7119 0.3342 2.6211 -0.5545
hfenergy: -1089.1394214 hartree
pointgroup: C01 [X(C28H17Br1)]
dipole: 0.7349719 0.3176506 -0.3959084 debye
polarizability: 481.0504146|-17.5815718|364.7311979|-23.2106517|-10.7752997|229.399823 unknown
InChI: InChI=1S/C28H17Br/c29-27-16-15-24(22-11-5-6-12-23(22)27)28-21-10-4-2-8-19(21)17-26-20-9-3-1-7-18(20)13-14-25(26)28/h1-17H
charge 0 multiplicity 1
46 atoms
Br -5.776118 -2.118839 1.742622
C  -0.214821 0.547174 0.36222
C  0.964721 -0.248145 0.288219
C  2.262881 0.37408 0.05317
C  -0.142605 1.968073 0.196935
C  -1.544718 -0.099338 0.639457
C  1.152291 2.585035 -0.040619
C  3.467953 -0.471767 -0.011715
C  2.315486 1.772798 -0.103738
C  3.337885 -1.896732 0.149159
C  0.897536 -1.69046 0.442159
C  -2.393349 -0.562308 -0.434288
C  2.028091 -2.474815 0.373349
C  -1.305237 2.81614 0.254526
C  -3.679938 -1.178609 -0.140131
C  -1.977142 -0.250371 1.962037
C  1.229064 4.011887 -0.206252
C  4.775116 0.058012 -0.227763
C  4.49519 -2.729385 0.088062
C  -1.99638 -0.431933 -1.80712
C  -1.195585 4.195185 0.087438
C  -4.054566 -1.299099 1.241641
C  -3.234165 -0.851066 2.273773
C  0.084189 4.802312 -0.14452
C  5.903904 -0.774986 -0.284641
C  -4.497988 -1.628844 -1.227701
C  5.767273 -2.181669 -0.126129
C  -2.81509 -0.880096 -2.844134
C  -4.076983 -1.483808 -2.550628
H  3.271789 2.275101 -0.282735
H  -0.080432 -2.149315 0.615639
H  1.95477 -3.562749 0.489536
H  -2.284204 2.360123 0.433321
H  -1.33954 0.098346 2.781184
H  2.210484 4.468141 -0.383188
H  4.917667 1.135729 -0.352164
H  4.3728 -3.811952 0.212791
H  -1.028489 0.030605 -2.026182
H  -2.090376 4.825799 0.132764
H  -3.544492 -0.955656 3.316973
H  0.152633 5.88817 -0.272138
H  6.894703 -0.338188 -0.45158
H  -5.464115 -2.091402 -1.003974
H  6.650174 -2.82836 -0.171098
H  -2.493462 -0.771195 -3.885424
H  -4.715603 -1.834126 -3.368716
