program: Gaussian 09
title: 000256402
version: EM64L-G09RevD.01
frameworkgroup: C1[X(C14H11ClN2O2)]
method: RPBEPBE
basis: SDD
operation: Freq
keyword: #p
keyword: freq=noraman
keyword: PBEPBE/SDD
title: #p freq=noraman PBEPBE/SDD
converged: YES YES NO NO
title: Mulliken charges:
elementType: Cl O O N N C C C C C C C C C C C C C C H H H H H H H H H H H
charge: -0.015209 -0.272606 -0.319456 -0.315313 -0.345902 0.408523 0.271621 0.161102 -0.315525 -0.368149 0.210207 -0.340421 -0.333187 -0.218998 -0.228417 -0.212614 -0.218859 -0.236394 -0.224675 0.261875 0.277449 0.211397 0.364288 0.354037 0.260558 0.240435 0.240630 0.234573 0.233910 0.235119
chargesum: 0.00000
title: Mulliken charges with hydrogens summed into heavy atoms:
elementType: Cl O O N N C C C C C C C C C C C C C C
charge: -0.015209 -0.272606 -0.319456 0.048975 0.008136 0.408523 0.271621 0.161102 -0.315525 -0.106274 0.210207 -0.062972 -0.121790 0.041560 0.012017 0.028016 0.015714 -0.002483 0.010444
polarizability: 3.07598883e+02 1.07661374e+01 1.80800605e+02 -9.97589384e-01 9.94965847e+00 9.54917811e+01
1716.lowfreq: -11.2270 -3.8924 -0.0016 -0.0015 -0.0009 2.9145 5.0857 24.7684 33.5944
frequency: -10.7169 24.7444 33.5579 43.1119 97.1154 100.3563 127.0765 147.3206 169.7368 211.8694 232.3212 278.4187 306.6767 342.4167 349.0583 396.3567 405.0000 424.8336 451.1303 460.3662 485.1355 555.4465 582.0895 612.2072 614.2687 640.5928 664.7128 673.4181 696.7647 699.1096 701.5209 744.4763 771.2267 790.4954 803.5890 850.8523 875.6917 919.9819 935.7007 956.9679 986.2081 989.4480 992.1208 1009.5195 1019.9144 1023.4576 1034.8739 1052.9539 1086.7508 1105.7332 1131.3565 1174.3542 1176.1439 1193.3150 1208.4892 1230.9911 1262.3071 1284.5260 1325.2144 1369.6198 1387.4208 1403.3063 1417.4395 1435.7583 1463.0136 1484.0963 1526.6621 1532.0482 1566.8752 1583.3343 1600.4353 1605.1674 1613.2512 3124.3948 3134.9604 3135.8224 3147.3195 3148.4300 3161.1633 3164.3116 3171.9244 3177.6040 3488.8026 3511.9438
redmass: 3.9324 7.9999 8.5654 6.0756 8.5151 5.6511 6.1422 6.4987 7.4051 5.9280 6.2870 6.7064 7.9569 7.5588 7.6544 2.7887 5.3794 6.9101 3.8677 4.4703 5.1653 4.2835 1.2690 1.1842 6.1408 6.4448 6.4322 5.3109 1.6522 3.6343 5.2280 2.9112 1.4721 2.2147 7.6956 1.2575 1.3715 5.9414 1.4307 1.3808 1.3828 6.1388 1.3404 1.3378 5.2212 2.8104 2.8568 2.5711 1.6746 2.3271 1.6451 1.0623 1.0631 1.2230 3.2074 1.6069 1.4888 2.2845 1.3761 8.7120 8.3926 2.9180 2.1449 2.3116 2.5846 2.3174 2.4891 8.3918 6.1072 7.3038 6.7239 6.7366 5.9023 1.0871 1.0874 1.0873 1.0899 1.0922 1.0958 1.0948 1.1009 1.1003 1.0798 1.0790
irintensity: 0.0395 0.4104 1.5884 3.3774 7.4041 2.2366 0.1920 0.6431 1.2741 2.8379 25.0320 4.5972 4.0679 0.3014 8.7747 0.5588 2.7057 8.5162 2.1140 8.9250 16.8243 15.0511 52.0625 114.8522 1.7382 13.0341 7.2544 26.5061 95.0009 11.9073 33.7660 18.1616 64.1917 26.3560 4.3312 0.0903 0.4900 1.6790 4.2382 2.3546 0.3677 0.7073 0.1564 0.6027 30.8256 25.4044 7.2315 14.2601 22.4960 2.9462 1.6498 1.6324 1.2009 10.3731 1.6253 6.3106 4.3592 0.4312 3.2634 9.9770 14.5060 906.5654 17.5600 24.4322 84.8750 52.7157 44.1706 301.9304 6.6574 56.5222 15.3644 8.6258 7.0429 10.4619 2.0169 1.7611 6.5279 20.8843 13.3907 9.7463 23.0091 14.0268 44.0988 125.1096
temp: 298.150 k
press: 1.00000 atm
elementType: 17 8 8 7 7 6 6 6 6 6 6 6 6 6 6 6 6 6 6 1 1 1 1 1 1 1 1 1 1 1
symmnumber: 1
zpe: 579103.2 jmol-1
zpe.correction: 0.220569 hartree
zpe.thermalcorrener: 0.236273 hartree
zpe.thermalcorrenthalpy: 0.237217 hartree
zpe.thermalcorrgfe: 0.175340 hartree
zpe.sumelectzpe: -1258.771069 hartree
zpe.sumelectthermal: -1258.755365 hartree
zpe.sumelectthermalent: -1258.754421 hartree
zpe.sumelectthermalfe: -1258.816298 hartree
dipole: 0.3865 -1.6723 0.4932
dipole: 1.7858
quadrupole: -81.0666 -117.8778 -121.6334
quadrupole: 17.6355 3.7031 -2.7165
quadrupole: 25.7927 -11.0185 -14.7742 17.6355 3.7031 -2.7165
hfenergy: -1258.9916377 hartree
pointgroup: C01 [X(C14H11Cl1N2O2)]
dipole: -0.1060973 -0.6445155 -0.258787 debye
polarizability: 308.1515423|-3.6267225|181.1193365|7.2761443|-2.1928153|94.6203901 unknown
InChI: InChI=1S/C14H11ClN2O2/c15-12-9-5-4-8-11(12)14(19)17-16-13(18)10-6-2-1-3-7-10/h1-9,16-17H
charge 0 multiplicity 1
30 atoms
Cl 3.618165 2.474144 1.193062
O  1.208318 1.803814 -0.798209
O  -1.493206 -1.860122 0.661861
N  0.503826 -0.240708 -0.010112
N  -0.821524 0.158981 -0.194642
C  2.897064 0.11077 -0.169262
C  -3.236603 -0.282853 -0.025035
C  1.507556 0.651274 -0.346021
C  3.938784 0.847995 0.44678
C  3.212482 -1.174944 -0.689951
C  -1.821269 -0.723538 0.173831
C  -4.252133 -1.173742 0.408486
C  -3.603747 0.955582 -0.61705
C  5.247695 0.336219 0.544719
C  4.517757 -1.700942 -0.599882
C  5.537838 -0.9418 0.016615
C  -5.611717 -0.833705 0.256848
C  -4.965065 1.293664 -0.767479
C  -5.97263 0.401495 -0.330862
H  2.427517 -1.747817 -1.196388
H  -3.945069 -2.123178 0.858818
H  -2.84929 1.667127 -0.973142
H  0.595834 -1.158628 0.440245
H  -0.904781 1.111978 -0.561803
H  6.025283 0.929756 1.033953
H  4.737886 -2.689374 -1.015156
H  6.556554 -1.336413 0.089348
H  -6.3883 -1.527866 0.595424
H  -5.239921 2.249824 -1.225378
H  -7.028705 0.667611 -0.449317
