program: Gaussian 09
title: 000256400
version: EM64L-G09RevD.01
frameworkgroup: C1[X(C10H11NO4)]
method: RPBEPBE
basis: SDD
operation: Freq
keyword: #p
keyword: freq=noraman
keyword: PBEPBE/SDD
title: #p freq=noraman PBEPBE/SDD
converged: YES YES NO NO
title: Mulliken charges:
elementType: O O O O N C C C C C C C C C C H H H H H H H H H H H
charge: -0.240145 -0.302648 -0.267822 -0.207390 0.006419 0.039374 -0.383433 0.280815 -0.250110 -0.160485 -0.361888 0.303804 0.269318 -0.746984 -0.764138 0.252424 0.242412 0.272332 0.234631 0.246420 0.251904 0.242832 0.255314 0.243663 0.239849 0.303532
chargesum: 0.00000
title: Mulliken charges with hydrogens summed into heavy atoms:
elementType: O O O O N C C C C C C C C C C
charge: -0.240145 -0.302648 -0.267822 -0.207390 0.006419 0.039374 0.111402 0.280815 0.022221 0.074146 -0.115468 0.303804 0.269318 0.003067 0.022907
polarizability: 1.48816774e+02 -1.54163574e+01 1.35166908e+02 1.12669594e+01 2.72875805e+00 9.13184236e+01
1716.lowfreq: -16.1808 -11.1264 -5.4259 0.0008 0.0009 0.0009 8.6574 24.1416 32.4891
frequency: -13.9262 24.1097 32.3861 61.6043 87.6076 96.3419 112.8248 140.8077 151.0704 196.7716 233.3785 300.3338 308.5849 339.4366 412.5183 424.2133 487.1604 509.2889 533.4035 551.5763 559.7098 593.5030 615.7790 647.5385 730.6153 751.3107 794.9496 808.1965 834.2985 877.3285 914.8886 927.7643 964.0497 978.4951 991.4197 999.5964 1044.0299 1049.2166 1056.5659 1092.7600 1152.1756 1174.6530 1199.7629 1225.3365 1243.8587 1272.0299 1326.6079 1355.3147 1383.2606 1384.4269 1424.1321 1438.2034 1442.9004 1448.8141 1452.1648 1454.8054 1461.5480 1562.0549 1569.8287 1644.0266 1684.4676 3007.8379 3008.0339 3059.6795 3100.9678 3101.5306 3137.5019 3140.8651 3143.3820 3144.3659 3162.1838 3188.7605
redmass: 3.8936 1.5823 3.3710 3.8143 5.1890 4.8414 3.1261 1.1073 4.9478 7.6152 6.1300 4.4923 3.0507 3.2929 3.7443 3.1992 4.4012 4.4877 4.4610 3.3371 3.2832 5.4053 4.7104 5.8290 4.5111 4.2277 5.0510 1.6713 4.9162 6.5852 4.3778 1.4337 2.4233 1.3936 2.1723 1.8817 1.6492 1.6391 2.2751 2.4556 2.3579 1.7285 3.2310 2.1856 1.8124 1.6885 3.8953 1.3408 1.2335 1.2425 1.9645 2.4782 1.2014 1.0570 1.0570 1.0545 1.0548 6.5471 6.6343 8.8862 10.4003 1.0365 1.0379 1.0569 1.0947 1.0963 1.0886 1.1090 1.1023 1.1020 1.0946 1.0978
irintensity: 1.7800 0.4952 0.6350 1.8624 2.4747 2.4441 7.8542 0.7741 5.9861 4.7628 2.8141 2.2094 4.1037 9.6838 4.1901 5.5830 3.4680 7.3500 13.7565 3.2853 1.1148 12.3056 7.0605 13.2687 7.5086 15.2190 37.1478 38.4362 40.7309 29.9367 44.6553 0.9761 14.7812 1.0130 76.5840 63.6026 8.5831 21.2106 0.5153 91.5337 269.8980 10.9524 336.2399 76.3868 12.2243 3.1406 8.6278 6.1730 79.2620 56.0795 23.0999 34.2296 37.8705 11.0564 23.6550 18.1522 23.7171 1.8471 3.3843 193.0410 162.7674 8.0964 0.8603 18.9009 8.2157 2.7702 8.9004 1.1224 6.8851 10.9503 24.9913 3.3777
temp: 298.150 k
press: 1.00000 atm
elementType: 8 8 8 8 7 6 6 6 6 6 6 6 6 6 6 1 1 1 1 1 1 1 1 1 1 1
symmnumber: 1
zpe: 512784.7 jmol-1
zpe.correction: 0.195309 hartree
zpe.thermalcorrener: 0.209604 hartree
zpe.thermalcorrenthalpy: 0.210548 hartree
zpe.thermalcorrgfe: 0.152096 hartree
zpe.sumelectzpe: -742.203550 hartree
zpe.sumelectthermal: -742.189256 hartree
zpe.sumelectthermalent: -742.188312 hartree
zpe.sumelectthermalfe: -742.246763 hartree
dipole: 0.5202 0.4772 -0.4679
dipole: 0.8469
quadrupole: -74.0545 -86.7034 -87.0997
quadrupole: 4.1830 1.2005 -6.1863
quadrupole: 8.5647 -4.0842 -4.4805 4.1830 1.2005 -6.1863
hfenergy: -742.3988599 hartree
pointgroup: C01 [X(C10H11N1O4)]
dipole: -0.2422325 -0.1158128 -0.1973023 debye
dipolederiv: -1.1351386 0.2366693 -0.2386414 0.4576607 -0.6571442 0.1575961 -0.4627073 0.1365452 -0.5029484 -0.55886 0.601657 -0.0161826 0.6458893 -1.771173 0.0691971 -0.0033665 0.1894447 -0.4887463 -0.5709963 -0.0316211 -0.1313351 0.2585186 -0.9181857 -0.116304 -0.0730539 -0.2851458 -0.4773259 -0.3690936 0.0269821 0.2155047 0.1464988 -0.6335064 0.0085453 0.0034157 0.4821711 -0.7928661 -0.3127033 0.0139893 0.0274988 0.0272885 -0.338337 0.0255584 0.0281769 0.0259513 -0.2326551 0.2617078 -0.017306 -0.0988761 0.1964519 -0.0215002 -0.0897172 -0.0344194 0.0628862 -0.0701651 0.6671539 0.0660364 0.0455669 0.0590396 0.2051434 -0.0081274 0.2135553 -0.1225162 0.3733158 0.1955304 -0.4385177 0.0029731 -0.4236461 0.7945289 0.1866413 -0.127938 0.4075799 0.1185765 -0.0241514 0.1300367 -0.0080606 0.009696 0.0508109 0.0098693 -0.0109814 -0.1514933 -0.0834905 0.0240866 -0.0145897 -0.0934603 0.1488737 -0.1516819 -0.0410962 -0.0733088 0.0038438 -0.0438045 0.0263377 -0.0422429 -0.0767138 -0.2388014 0.2765844 0.0994935 -0.0722955 0.0346967 -0.0318286 1.0648841 -0.2631479 0.4891781 -0.7983494 1.2417541 0.0221083 0.5599996 0.2321654 0.7124532 0.6287567 -0.4852079 -0.2477066 -0.6662906 1.7545399 -0.1503588 0.0507862 -0.8622756 1.08409 -0.1177924 -0.0358375 -0.1468693 -0.0345164 -0.0318233 -0.0875462 -0.2784069 -0.1086429 -0.2589996 -0.2489307 0.1984764 0.1779645 0.1068732 -0.1614609 -0.0933824 0.1566521 -0.1446458 -0.1167046 0.0166476 0.0281787 0.0149412 0.0051428 0.0553188 -0.1309877 -0.0344302 -0.0292823 0.0421441 0.0097622 0.0016729 -0.0193177 -0.0320169 -0.0145892 0.1163448 -0.0482946 0.0446088 0.0447728 0.1066327 -0.0331975 0.0112663 -0.0514633 -0.0063791 0.0003434 0.0249656 0.0126399 0.1305506 -0.0542671 0.0039715 0.0983829 -0.0195556 0.0894809 0.0083992 0.1098507 -0.0012882 0.1054472 0.0251031 0.0766444 0.0551778 0.1034208 -0.0339227 -0.0561505 0.0722094 -0.0505467 0.1075946 0.0878122 -0.0425793 -0.0297069 -0.0717005 -0.0465908 0.0267363 0.0194069 0.0508151 0.1191296 -0.0279934 0.0679718 -0.0411365 0.1140483 0.0257689 -0.0050513 -0.0196158 -0.0175249 0.1094309 0.0316477 -0.014882 0.0868046 -0.0051404 0.1254868 0.0130108 0.0512407 -0.000112 -0.0054168 0.0967957 -0.0163915 -0.0916986 0.0376029 0.0924491 -0.0145361 -0.0670425 -0.0272653 -0.0352189 0.1153101 0.0149235 0.0099347 0.0460769 -0.0761387 0.0411132 0.0104326 0.0843436 0.0532114 0.0617583 -0.0316891 0.004512 -0.0216015 0.150567 0.0083007 0.0051691 0.0330473 0.1394537 unknown
polarizability: 141.0711674|-15.7066417|142.6328918|-12.7737803|4.7188214|91.5980462 unknown
InChI: InChI=1S/C10H11NO4/c1-7(12)14-6-9-10(15-8(2)13)4-3-5-11-9/h3-5H,6H2,1-2H3
charge 0 multiplicity 1
26 atoms
O  1.729045 1.476741 -0.042232
O  -0.490622 -1.379182 -0.871711
O  2.504149 -0.722844 -0.224569
O  -0.52509 -2.653419 1.105536
N  -1.343802 2.12352 -0.062931
C  -0.661984 1.010194 -0.471664
C  0.691766 1.241737 -1.106345
C  -1.206113 -0.291707 -0.306385
C  -2.453513 -0.462058 0.331408
C  -3.134616 0.691043 0.775064
C  -2.549498 1.958917 0.548702
C  2.556652 0.408019 0.312041
C  -0.132796 -2.511871 -0.064941
C  3.487288 0.819925 1.43169
C  0.777571 -3.406414 -0.860315
H  1.005374 0.387267 -1.726687
H  0.679445 2.18628 -1.668751
H  -2.870245 -1.461974 0.472441
H  -4.103812 0.610406 1.276849
H  -3.05775 2.877744 0.860994
H  3.847238 1.850031 1.282695
H  4.332053 0.118014 1.489895
H  2.937024 0.793884 2.389896
H  0.399101 -3.537007 -1.887259
H  0.882923 -4.379396 -0.359338
H  1.761513 -2.907547 -0.922881
