program: Gaussian 09
title: 000256398
version: EM64L-G09RevD.01
frameworkgroup: C1[X(C12H17O5P)]
method: RPBEPBE
basis: SDD
operation: Freq
keyword: #p
keyword: freq=noraman
keyword: PBEPBE/SDD
title: #p freq=noraman PBEPBE/SDD
converged: YES YES NO NO
title: Mulliken charges:
elementType: P O O O O O C C C C C C C C C C C C H H H H H H H H H H H H H H H H H
charge: 1.213029 -0.519395 -0.503447 -0.634920 -0.170517 -0.249151 -0.269656 0.413056 -0.354312 -0.320582 -0.239526 -0.209665 -0.350236 -0.362952 0.339484 -0.646531 -0.661764 -0.536484 0.274399 0.310024 0.222890 0.228266 0.224024 0.235043 0.249947 0.261986 0.207760 0.245314 0.227326 0.204487 0.232633 0.226239 0.229917 0.253882 0.229435
chargesum: 0.00000
title: Mulliken charges with hydrogens summed into heavy atoms:
elementType: P O O O O O C C C C C C C C C C C C
charge: 1.213029 -0.519395 -0.503447 -0.634920 -0.170517 -0.249151 -0.269656 0.413056 -0.079914 -0.010558 0.211630 0.249401 -0.100290 -0.100966 0.339484 0.033869 0.001595 0.176750
polarizability: 2.86431928e+02 1.01006442e+01 1.54342370e+02 5.46508003e+00 2.09244803e+01 1.29102852e+02
1716.lowfreq: -38.8689 -7.1320 0.0016 0.0016 0.0017 4.3127 6.8567 12.4818 21.6932
frequency: -36.6789 11.9869 21.6644 42.1620 50.9867 61.8813 80.2354 96.8780 115.8926 137.8170 141.0888 156.9991 180.7142 198.0107 218.3986 228.6398 243.8436 261.0468 265.1093 293.0380 302.3140 342.5171 368.0086 396.1114 415.6585 435.7792 477.0247 501.4309 514.6513 576.8708 608.5117 624.0995 626.5034 669.6339 746.5587 763.7829 795.5167 805.0439 825.1519 857.5166 858.5830 865.8209 888.6967 975.5543 978.2907 997.9594 999.1643 1008.0907 1010.2514 1022.1822 1093.9888 1100.7150 1109.8659 1123.3892 1133.7414 1141.4964 1157.2262 1182.6445 1237.7437 1251.2123 1253.3345 1270.0893 1318.7096 1352.9839 1354.4372 1373.0842 1385.5144 1390.7986 1434.1468 1442.1619 1455.6836 1459.2390 1464.3460 1468.7907 1469.9824 1477.9256 1483.2829 1489.6085 1497.1823 1556.3306 1583.9716 1621.2535 2973.6260 2986.8355 2990.3771 3003.0077 3005.1959 3068.2008 3068.2260 3071.2097 3083.2503 3087.4428 3108.1427 3108.4497 3117.6322 3137.5029 3149.6256 3169.7867 3173.4193
redmass: 2.3007 4.6669 2.9371 3.1615 3.0789 3.0011 4.2946 4.1254 6.3338 4.3986 4.2066 5.6391 4.7242 3.0642 1.1636 1.4647 1.5989 3.9829 2.2940 4.2925 6.8279 6.0100 4.4487 4.4427 3.0069 6.0159 7.6350 3.2283 4.7835 6.7589 5.6971 7.0416 6.1219 5.9746 4.2887 6.0670 1.1210 1.0952 1.3225 3.9292 1.6271 3.9831 5.6239 8.5613 1.3577 1.5624 2.0473 4.0391 3.2343 4.0629 2.1789 2.2110 1.2582 1.3608 1.4423 1.5454 1.3373 1.3171 3.2451 1.1488 3.2637 1.1172 1.3134 1.2399 1.2211 4.5566 1.2358 1.2455 1.3078 3.1717 1.0407 1.0422 1.0729 1.0799 1.0499 1.0516 1.0547 1.0821 2.3323 7.2948 9.4044 6.5160 1.0324 1.0361 1.0359 1.0598 1.0577 1.1065 1.1050 1.1052 1.0972 1.0977 1.1028 1.1036 1.0947 1.1003 1.0880 1.0957 1.0947
irintensity: 0.1786 1.9620 0.5880 0.2166 1.5010 3.1538 0.4803 1.3217 1.7558 6.2412 5.6397 2.7449 13.2902 21.0951 0.3367 2.0865 5.2069 10.3375 7.9652 2.3217 4.1215 8.4889 2.2963 9.5221 0.2913 59.6996 54.2416 9.3738 6.1685 170.7784 47.1421 5.3411 29.8845 82.6533 0.3210 6.8347 6.5349 2.1307 15.3949 189.3218 30.4983 192.7670 34.5386 68.9230 1.4522 1.5865 2.0872 132.7214 211.2284 48.3357 11.2504 6.8150 0.1590 10.4113 4.0435 6.7588 0.8664 279.2389 89.1028 8.4837 286.1216 0.1381 1.7555 5.4702 12.2736 42.9280 26.0351 24.0380 6.1488 11.0867 10.6905 12.5605 2.5584 69.1238 15.6489 7.8513 11.7531 11.9666 71.2469 42.4258 347.0452 182.9819 67.1588 21.3665 27.8513 37.9359 22.9112 3.6123 41.0212 4.1452 39.8903 30.4450 45.1170 27.1452 24.6393 19.8493 0.4882 9.8609 10.2802
temp: 298.150 k
press: 1.00000 atm
elementType: 15 8 8 8 8 8 6 6 6 6 6 6 6 6 6 6 6 6 1 1 1 1 1 1 1 1 1 1 1 1 1 1 1 1 1
symmnumber: 1
zpe: 714771.6 jmol-1
zpe.correction: 0.272242 hartree
zpe.thermalcorrener: 0.292333 hartree
zpe.thermalcorrenthalpy: 0.293277 hartree
zpe.thermalcorrgfe: 0.220732 hartree
zpe.sumelectzpe: -1183.407090 hartree
zpe.sumelectthermal: -1183.387000 hartree
zpe.sumelectthermalent: -1183.386056 hartree
zpe.sumelectthermalfe: -1183.458600 hartree
dipole: 4.1138 -0.5581 -2.9388
dipole: 5.0864
quadrupole: -73.6808 -109.2961 -124.0120
quadrupole: -7.6416 -0.6223 -1.9180
quadrupole: 28.6488 -6.9665 -21.6824 -7.6416 -0.6223 -1.9180
hfenergy: -1183.6793325 hartree
pointgroup: C01 [X(C12H17O5P1)]
dipole: 1.4123766 -1.0883722 0.9083932 debye
polarizability: 263.2807581|-53.5354989|144.9525341|-13.5970529|23.5925879|161.6438574 unknown
InChI: InChI=1S/C12H17O5P/c1-4-16-18(14,17-5-2)12(13)10-6-8-11(15-3)9-7-10/h6-9H,4-5H2,1-3H3
charge 0 multiplicity 1
35 atoms
P  -1.758257 1.041885 -0.206485
O  -2.877996 -0.141566 0.430095
O  -2.397494 2.581087 0.279989
O  -1.576082 0.998188 -1.793887
O  -0.473838 0.970539 2.220427
O  4.642184 -1.389915 -0.982623
C  -0.257536 0.694956 1.012811
C  0.994778 0.150952 0.47162
C  2.042539 -0.135843 1.395975
C  1.20923 -0.088584 -0.921569
C  -3.962492 -0.63776 -0.473305
C  -3.000451 2.792074 1.634719
C  3.27092 -0.650861 0.958634
C  2.435395 -0.599991 -1.364161
C  3.469708 -0.88474 -0.432311
C  -3.545849 -1.953794 -1.133315
C  -3.89399 4.023705 1.515131
C  5.759876 -1.705401 -0.080783
H  1.866696 0.054743 2.459915
H  0.418008 0.139251 -1.646221
H  -4.827911 -0.769795 0.198581
H  -4.202333 0.130335 -1.232897
H  -3.568817 1.888449 1.923593
H  -2.178352 2.939932 2.357219
H  4.059012 -0.865423 1.685984
H  2.623849 -0.786786 -2.425153
H  -4.393709 -2.373351 -1.707792
H  -2.703342 -1.791122 -1.826799
H  -3.245514 -2.691712 -0.36948
H  -4.341474 4.259728 2.499112
H  -3.30768 4.896132 1.17972
H  -4.706805 3.851671 0.789077
H  6.107228 -0.801124 0.453155
H  6.556505 -2.079321 -0.739108
H  5.474795 -2.488637 0.64643
