program: Gaussian 09
title: 000264489
version: EM64L-G09RevD.01
frameworkgroup: C1[X(C26H20)]
method: RPBEPBE
basis: SDD
operation: Freq
keyword: #p
keyword: freq=noraman
keyword: PBEPBE/SDD
title: #p freq=noraman PBEPBE/SDD
converged: YES YES NO NO
title: Mulliken charges:
elementType: C C C C C C C C C C C C C C C C C C C C C C C C C C H H H H H H H H H H H H H H H H H H H H
charge: 0.117735 0.078762 0.169314 0.487774 0.154413 0.057492 0.463206 -0.826115 0.423920 0.162698 -0.508142 -0.513197 -0.343632 -0.367169 0.347964 -0.333567 -0.462994 -0.463193 -0.818844 -0.271235 -0.243449 -0.450135 -0.250360 -0.292930 -0.259496 -0.817268 0.246022 0.242452 0.236872 0.264795 0.258124 0.266095 0.244508 0.238850 0.227608 0.257107 0.221881 0.226218 0.228583 0.229758 0.228862 0.229098 0.229026 0.226838 0.227677 0.228074
chargesum: 0.00000
title: Mulliken charges with hydrogens summed into heavy atoms:
elementType: C C C C C C C C C C C C C C C C C C C C C C C C C C
charge: 0.117735 0.078762 0.169314 0.487774 0.154413 0.057492 0.463206 -0.580093 0.423920 0.162698 -0.265690 -0.276325 -0.078837 -0.109045 0.347964 -0.067472 -0.218486 -0.224343 -0.112249 -0.045018 -0.014866 -0.220376 -0.021498 -0.063832 -0.030470 -0.134680
polarizability: 4.14266975e+02 -2.36613028e+01 3.34550886e+02 -3.73034268e+00 -1.38534712e+01 1.68340285e+02
1716.lowfreq: -10.1745 -5.8965 -4.6603 -0.0008 -0.0005 0.0001 6.9902 38.5310 52.5567
frequency: -7.1111 38.4992 52.5507 62.5559 68.7716 82.5177 133.2782 135.3909 156.8138 158.8784 174.7772 216.5818 230.3709 236.3407 272.2918 307.1972 313.4549 331.0623 347.9577 355.4304 404.6304 425.6738 449.2674 456.5075 490.2376 504.9226 508.7387 516.6297 528.3991 545.9202 555.4704 563.1558 584.3945 614.8806 628.4232 643.6301 659.1651 710.0277 727.2005 733.6386 755.0433 760.1644 765.3287 776.3245 787.2669 804.4168 814.5224 821.4690 840.9871 861.9703 868.8830 889.7360 894.9590 913.2352 926.3574 932.8514 961.2366 969.4542 977.2288 986.6241 987.0888 992.1444 993.8430 994.2469 1025.1393 1030.1371 1052.1278 1055.3651 1057.5516 1083.5216 1103.7324 1133.9435 1159.2753 1173.4456 1175.0293 1178.7298 1191.6718 1203.6322 1216.7416 1231.8486 1244.9370 1259.5466 1269.0063 1294.2217 1306.0821 1327.6666 1352.2329 1366.8107 1391.5970 1394.1292 1403.1931 1404.8670 1407.5015 1429.4878 1433.0003 1437.1714 1445.3181 1454.3713 1461.4750 1472.0965 1477.3399 1480.5862 1488.1739 1493.1841 1543.0146 1564.9282 1590.0573 1592.6222 1595.3765 1614.6702 1624.8512 1640.6194 2969.4232 2970.6579 3038.6985 3044.2534 3083.5998 3101.8045 3115.2975 3118.0037 3119.4572 3119.9343 3120.7618 3133.2510 3133.6512 3134.0284 3143.2712 3153.6179 3156.6100 3157.5925 3169.2683 3231.7019
redmass: 3.4929 3.1374 3.7942 3.1254 1.5914 2.8904 3.9705 3.3035 1.6219 1.9953 4.2836 4.6990 4.3401 3.0216 4.2897 3.0809 3.1408 5.0535 4.5726 4.7419 3.1930 3.0542 5.0510 3.0423 5.3240 4.6970 3.1734 3.4262 6.6392 3.2877 5.7347 3.1777 5.2888 4.8875 6.0175 4.1554 5.5409 3.4925 4.4312 3.1154 1.2545 3.9763 1.3468 2.4051 2.9570 2.4271 4.2158 1.5866 2.0537 3.8136 1.5291 1.7936 4.4559 1.4604 2.9308 1.9096 1.4030 1.4174 1.3717 1.4126 1.4453 1.3493 4.9426 1.3821 1.5069 2.1570 1.6750 2.1741 2.2514 2.1161 2.3224 1.7214 1.4088 1.2213 1.1194 1.1766 2.6600 1.3308 1.8941 2.0527 1.8491 1.8764 2.0358 2.0071 2.0129 4.5485 6.9196 4.0924 1.2557 5.0216 1.2235 2.5689 1.9930 2.4749 4.1007 2.9543 2.3961 2.1030 1.0512 1.3735 1.0587 1.2339 2.8105 3.3060 5.8654 7.5758 6.6203 5.8014 5.8592 6.0020 6.6273 6.8642 1.0383 1.0393 1.0965 1.0967 1.0984 1.0962 1.0887 1.0881 1.0864 1.0864 1.0864 1.0898 1.0908 1.0907 1.0991 1.0958 1.0995 1.0993 1.0974 1.0904
irintensity: 0.1305 0.1618 0.0730 0.6111 0.2371 0.0517 0.0807 0.1098 0.6500 0.7198 0.2363 3.0327 1.7695 1.2129 0.0763 1.8282 2.7162 1.5760 0.9011 0.7374 2.7157 0.9544 1.9835 2.7776 0.6612 1.6306 0.2009 0.0181 0.5789 14.7446 2.6331 1.4193 3.2947 2.1988 3.4006 3.4077 1.5982 2.7154 1.0978 9.8016 0.0985 6.1257 101.2234 20.1116 12.6552 11.3261 2.7259 20.5977 0.5571 2.5558 6.4071 15.5013 1.3251 0.2465 6.7705 36.8165 2.8560 7.5271 0.1385 2.1045 6.6585 1.0132 1.3568 0.1066 11.3916 6.0396 1.1757 4.9423 8.4451 7.5871 2.0119 3.0038 2.9437 5.1779 2.0385 3.6212 2.8335 2.8276 0.1271 1.7858 1.4763 1.0983 1.9482 2.8189 1.2136 13.1153 0.9575 3.3043 1.4400 10.2717 27.8890 2.1161 1.4607 1.6147 0.6021 6.4157 7.6142 6.8367 3.0956 8.4840 15.6088 20.8237 4.3957 17.3919 0.3128 0.8948 10.0044 1.0513 0.4532 0.3130 0.7641 0.8622 55.2311 5.9549 23.2753 6.3372 25.8507 11.1824 1.9366 7.1679 2.0574 7.0229 5.3130 5.6963 20.2561 21.2045 45.7384 37.7245 26.2083 45.0142 27.7414 6.6673
temp: 298.150 k
press: 1.00000 atm
elementType: 6 6 6 6 6 6 6 6 6 6 6 6 6 6 6 6 6 6 6 6 6 6 6 6 6 6 1 1 1 1 1 1 1 1 1 1 1 1 1 1 1 1 1 1 1 1
symmnumber: 1
zpe: 973448.8 jmol-1
zpe.correction: 0.370767 hartree
zpe.thermalcorrener: 0.390609 hartree
zpe.thermalcorrenthalpy: 0.391553 hartree
zpe.thermalcorrgfe: 0.323169 hartree
zpe.sumelectzpe: -1001.060958 hartree
zpe.sumelectthermal: -1001.041116 hartree
zpe.sumelectthermalent: -1001.040172 hartree
zpe.sumelectthermalfe: -1001.108556 hartree
dipole: 0.2248 0.6842 0.7213
dipole: 1.0193
quadrupole: -138.6510 -131.0094 -153.6097
quadrupole: 0.6701 -0.2701 -0.9420
quadrupole: 2.4390 10.0807 -12.5197 0.6701 -0.2701 -0.9420
hfenergy: -1001.4317249 hartree
pointgroup: C01 [X(C26H20)]
dipole: -0.0508167 0.2721096 -0.2901571 debye
polarizability: 419.4114598|10.7900047|329.9313549|-5.319088|9.9791168|167.8153312 unknown
InChI: InChI=1S/C26H20/c1-17-8-7-13-22(18(17)2)26-24-12-6-4-10-20(24)16-21-15-14-19-9-3-5-11-23(19)25(21)26/h3-16H,1-2H3
charge 0 multiplicity 1
46 atoms
C  0.500948 -1.083308 0.068352
C  -0.595586 -0.168616 0.177711
C  -1.960919 -0.641964 0.155446
C  0.176449 -2.507021 -0.073204
C  1.944556 -0.717579 0.077203
C  -0.449369 1.324097 0.339607
C  -2.246711 -2.058902 0.021401
C  -1.1583 -2.953474 -0.090212
C  2.940457 -1.75885 -0.074248
C  -0.397929 2.198552 -0.786612
C  1.223106 -3.500277 -0.208144
C  2.548523 -3.145147 -0.215325
C  -3.085201 0.255894 0.256804
C  -0.449218 1.862447 1.65341
C  -0.315219 3.61081 -0.574155
C  2.445161 0.614358 0.232055
C  -3.608896 -2.519561 -0.000448
C  4.331708 -1.441842 -0.081176
C  -0.399532 1.652849 -2.203149
C  -4.3962 -0.217954 0.229912
C  -0.366441 3.253894 1.860541
C  -0.295889 4.120875 0.747029
C  -4.666588 -1.620624 0.101375
C  3.819249 0.907228 0.224927
C  4.78007 -0.123372 0.063516
C  -0.246412 4.56424 -1.754595
H  -1.355456 -4.027581 -0.197542
H  0.921508 -4.549325 -0.309869
H  3.335464 -3.900629 -0.323379
H  -2.900961 1.328598 0.360213
H  -0.503591 1.177478 2.506539
H  1.755498 1.44306 0.369236
H  -3.79683 -3.595318 -0.100391
H  5.051128 -2.261032 -0.200811
H  0.549564 1.890427 -2.722792
H  -0.524354 0.559265 -2.21674
H  -1.213565 2.097856 -2.806719
H  -5.231568 0.48668 0.309396
H  -0.358803 3.659364 2.878262
H  -0.230391 5.204648 0.901694
H  -5.702754 -1.975977 0.083987
H  4.144141 1.946159 0.349742
H  5.850743 0.1079 0.0571
H  0.620709 4.344051 -2.406243
H  -1.147796 4.488616 -2.393134
H  -0.159703 5.610703 -1.41627
