program: Gaussian 09
title: 000256369
version: EM64L-G09RevD.01
frameworkgroup: C1[X(C17H32O3)]
method: RPBEPBE
basis: SDD
operation: Freq
keyword: #pfreq=noraman
keyword: PBEPBE/SDD
title: #p freq=noraman PBEPBE/SDD
converged: YES YES NO NO
title: Mulliken charges:
elementType: O O O C C C C C C C C C C C C C C C C C H H H H H H H H H H H H H H H H H H H H H H H H H H H H H H H H
charge: -0.274864 -0.288702 -0.254651 -0.013812 -0.484268 -0.412134 -0.445296 -0.404926 -0.303532 0.046529 -0.380200 -0.368255 -0.723454 -0.369268 -0.369469 -0.519758 -0.346598 0.253512 -0.359033 -0.694429 0.203407 0.232062 0.216796 0.199056 0.230782 0.220443 0.226230 0.247524 0.183024 0.187680 0.223366 0.228559 0.199619 0.200118 0.187796 0.192344 0.224559 0.242780 0.213598 0.223531 0.198480 0.175915 0.194824 0.231955 0.233509 0.178240 0.192790 0.198712 0.190559 0.205501 0.212102 0.216747
chargesum: 0.00000
title: Mulliken charges with hydrogens summed into heavy atoms:
elementType: O O O C C C C C C C C C C C C C C C C C
charge: -0.274864 -0.288702 -0.254651 0.189595 -0.035410 0.017705 0.001377 0.025622 0.107514 0.275088 0.019537 0.011885 -0.042517 0.052744 0.001270 -0.054295 0.024432 0.253512 0.030238 -0.060079
polarizability: 2.21251099e+02 -1.82469327e+00 1.93129653e+02 -4.77959953e+00 -1.19325814e+00 1.60903120e+02
1716.lowfreq: -10.1430 -6.6593 -0.0009 -0.0007 0.0003 4.9694 10.2633 19.5178 33.0198
frequency: 5.2329 19.3070 33.0069 35.5028 39.7695 50.1399 51.7653 63.8343 71.8148 85.5147 111.2477 121.5104 126.8840 140.7525 154.8636 166.2598 188.8955 204.5007 219.2773 232.9508 243.9235 252.1026 259.1884 295.6103 325.7286 366.1797 412.3585 426.3190 454.5749 466.9619 486.9349 508.6261 563.0077 573.7950 618.3273 640.1645 720.2760 728.6350 731.7703 756.2236 765.4424 813.8203 815.0466 855.3230 857.0142 868.2074 884.5289 891.4682 897.1050 915.1532 921.2741 929.0170 955.5327 978.2830 996.1401 1001.5578 1013.9010 1020.9575 1033.2991 1041.0206 1050.2494 1058.3545 1072.1251 1079.3375 1087.4502 1112.8230 1116.9398 1119.6587 1121.1101 1146.5251 1151.7352 1166.0934 1177.6141 1193.4249 1201.0652 1208.2684 1222.9992 1235.8748 1237.3870 1247.8127 1271.4764 1277.6305 1279.5803 1280.9814 1286.2698 1292.0443 1296.1851 1306.8471 1310.7866 1315.3902 1319.2288 1324.6526 1330.1573 1339.5930 1348.4116 1350.1815 1354.5583 1363.4978 1369.3057 1388.0874 1389.4855 1442.4235 1445.8521 1457.8451 1458.3960 1459.2862 1462.4584 1462.8180 1466.9017 1468.7187 1469.3047 1476.0634 1477.2238 1477.5192 1483.5688 1488.3190 1490.8863 1625.7656 2942.6350 2947.0770 2948.2758 2953.8668 2961.7041 2962.9744 2965.0559 2968.8951 2971.1044 2980.0729 2982.1955 2982.4023 2989.3135 2990.7481 2993.6853 2994.7162 3005.1924 3009.5065 3012.6285 3020.3217 3034.1662 3036.9261 3051.3766 3061.7621 3066.1455 3066.3832 3069.5600 3070.1949 3071.7840 3085.0923 3086.1198 3098.0664
redmass: 3.2249 3.9191 3.4844 4.3483 4.1695 3.1340 2.3177 3.3592 3.1813 3.4406 1.6861 2.7740 3.0371 2.4001 2.0205 2.3741 2.8423 2.0435 1.2831 1.1274 2.4381 2.3431 3.7336 2.8792 2.8090 3.0695 3.3345 2.9650 2.8603 2.6219 2.7597 3.4214 3.3542 2.2730 2.6155 3.5844 1.0647 1.1337 1.8176 1.4528 2.4963 1.5823 1.7066 2.4463 2.2032 2.0017 1.4804 1.8630 1.9671 1.9861 1.9310 1.8638 1.5613 2.0362 1.8009 2.4518 2.6451 2.7105 2.0216 2.3267 2.0803 2.3624 2.4668 2.1722 1.9191 2.1840 2.3648 1.8690 2.1721 1.9911 1.4143 1.4656 1.8952 1.5115 1.5215 1.9060 1.3507 1.4314 1.3228 1.2657 1.2657 1.2503 1.2625 1.0771 1.1860 1.1641 1.0912 1.1980 1.3337 1.3152 1.2996 1.2783 1.3573 1.2957 1.4812 1.5283 1.6517 1.5543 1.7152 1.2309 1.2166 1.0801 1.0773 1.0883 1.0809 1.0802 1.0719 1.0811 1.0600 1.0775 1.0878 1.0754 1.0465 1.0461 1.0871 1.0902 1.0920 10.5733 1.0689 1.0592 1.0592 1.0599 1.0597 1.0646 1.0605 1.0841 1.0363 1.0646 1.0616 1.0932 1.0378 1.0921 1.0705 1.0633 1.0994 1.0614 1.0860 1.1024 1.1033 1.0936 1.1011 1.1000 1.1003 1.0957 1.1002 1.0972 1.0994 1.1048 1.0988 1.1009
irintensity: 0.1366 0.1514 0.3751 0.9837 2.9885 2.4454 0.4024 0.9105 1.2464 1.1680 0.0547 0.3354 0.8014 0.8065 0.2026 3.4201 1.1983 1.0380 0.3201 0.0113 1.3303 1.4037 0.4312 2.3309 1.4423 5.8186 6.2259 7.9161 0.0985 2.2883 1.1231 3.5895 0.4570 3.4283 2.2232 1.3308 17.6424 0.3958 4.3425 2.4885 8.4741 6.9559 4.5297 5.7105 9.9678 14.4325 6.2583 1.4666 13.9415 10.7440 33.3282 10.6193 2.9586 14.8411 6.2946 63.8990 25.5109 10.2993 38.0067 8.1714 56.9128 4.1458 12.0563 0.6993 18.4540 41.9320 15.6578 12.4940 0.5734 25.3577 0.5292 4.7033 41.6280 2.7577 6.5601 109.9756 3.3730 25.0887 7.6351 4.8611 3.3710 2.8002 2.3444 1.0608 2.3833 0.6054 0.8059 2.3972 1.8833 2.2351 2.1953 5.4370 1.1682 0.5412 1.1455 19.6797 0.3224 0.9759 4.3347 20.6982 12.2957 15.7074 0.5235 2.5228 3.3312 4.3827 4.5820 4.5245 17.7535 0.7651 10.0874 1.7099 10.0824 12.1891 3.3570 15.8513 11.1660 201.2242 86.4721 3.3889 0.5334 12.3728 1.2478 13.9882 141.2754 30.8648 34.5404 41.8191 21.4283 3.0047 34.0081 5.3333 32.0228 34.7525 3.0515 29.6206 7.5103 2.9255 163.8394 8.0417 53.9369 26.3637 106.2297 33.3784 20.0757 55.9458 53.5032 59.5536 54.9060 21.6146
temp: 298.150 k
press: 1.00000 atm
elementType: 8 8 8 6 6 6 6 6 6 6 6 6 6 6 6 6 6 6 6 6 1 1 1 1 1 1 1 1 1 1 1 1 1 1 1 1 1 1 1 1 1 1 1 1 1 1 1 1 1 1 1 1
symmnumber: 1
zpe: 1212429.2 jmol-1
zpe.correction: 0.461790 hartree
zpe.thermalcorrener: 0.486211 hartree
zpe.thermalcorrenthalpy: 0.487155 hartree
zpe.thermalcorrgfe: 0.402520 hartree
zpe.sumelectzpe: -891.042591 hartree
zpe.sumelectthermal: -891.018170 hartree
zpe.sumelectthermalent: -891.017226 hartree
zpe.sumelectthermalfe: -891.101861 hartree
dipole: -2.5031 0.5948 0.2261
dipole: 2.5827
quadrupole: -128.4631 -120.5795 -130.0093
quadrupole: 4.2985 6.9317 -9.8838
quadrupole: -2.1125 5.7711 -3.6586 4.2985 6.9317 -9.8838
hfenergy: -891.5043809 hartree
pointgroup: C01 [X(C17H32O3)]
dipole: -0.8041209 -0.6185048 -0.0579172 debye
polarizability: 214.2784597|12.8024947|198.1997003|7.8157168|-4.5860464|162.8057126 unknown
InChI: InChI=1S/C17H32O3/c1-3-4-5-6-7-8-11-17(18)20-15(2)12-13-16-10-9-14-19-16/h15-16H,3-14H2,1-2H3
charge 0 multiplicity 1
52 atoms
O  0.682815 -2.804484 -0.510396
O  2.465904 1.4219 -0.288886
O  2.788397 3.228923 1.152413
C  0.784453 -2.421043 0.935934
C  -0.647626 -2.567525 1.520902
C  1.365587 -1.003009 1.061108
C  -1.373816 -3.495318 0.512929
C  2.780607 -0.87073 0.461806
C  -0.739905 -3.063014 -0.823422
C  3.352995 0.550182 0.567977
C  -0.832692 2.312876 -0.451015
C  -1.901283 1.363499 -1.035725
C  4.792041 0.686118 0.054883
C  0.240269 2.712726 -1.489271
C  -2.949802 0.898822 0.000673
C  1.415619 3.514761 -0.881883
C  -3.966686 -0.113926 -0.572054
C  2.276377 2.745243 0.114021
C  -4.980704 -0.628797 0.475421
C  -5.977224 -1.655463 -0.105277
H  1.478193 -3.157648 1.391723
H  -0.638244 -2.974303 2.546248
H  -1.143007 -1.577832 1.549164
H  1.381489 -0.721856 2.135739
H  0.685209 -0.297801 0.547234
H  -2.470669 -3.36762 0.527838
H  -1.13865 -4.554659 0.721973
H  2.75585 -1.185648 -0.59777
H  3.477864 -1.555138 0.987495
H  -1.221187 -2.137784 -1.209095
H  -0.765701 -3.838003 -1.607725
H  3.279245 0.936819 1.602904
H  -1.320114 3.222924 -0.043965
H  -0.340052 1.813241 0.40839
H  -1.391374 0.473363 -1.461986
H  -2.416234 1.860399 -1.884537
H  4.861865 0.364945 -0.999527
H  5.138516 1.730659 0.13441
H  5.470534 0.053618 0.656346
H  0.640776 1.801743 -1.971454
H  -0.228169 3.323063 -2.287376
H  -2.425939 0.439078 0.866151
H  -3.492203 1.779923 0.402395
H  2.089984 3.854342 -1.694243
H  1.058688 4.420792 -0.360681
H  -3.416657 -0.978638 -1.001509
H  -4.51654 0.351432 -1.416577
H  -5.537983 0.231954 0.897946
H  -4.42779 -1.085291 1.32263
H  -5.445981 -2.539013 -0.508193
H  -6.56368 -1.213305 -0.932642
H  -6.689563 -2.009998 0.662261
