program: Gaussian 09
title: 000264467
version: EM64L-G09RevD.01
frameworkgroup: C1[X(C22H18)]
method: RPBEPBE
basis: SDD
operation: Freq
keyword: #p
keyword: freq=noraman
keyword: PBEPBE/SDD
title: #p freq=noraman PBEPBE/SDD
converged: NO NO NO NO
title: Mulliken charges:
elementType: C C C C C C C C C C C C C C C C C C C C C C H H H H H H H H H H H H H H H H H H
charge: 0.064241 0.175816 0.175814 0.247302 0.451467 0.451474 -0.796472 -0.563665 0.334179 -0.368584 -0.368579 -0.391377 0.312472 -0.459463 -0.459462 -0.409492 -0.260315 -0.260318 -0.247001 -0.247001 -0.821206 -0.810480 0.244338 0.254019 0.250022 0.259046 0.259040 0.242775 0.242775 0.230448 0.225753 0.225751 0.226932 0.226931 0.233860 0.224791 0.224696 0.225258 0.225327 0.228889
chargesum: 0.00000
title: Mulliken charges with hydrogens summed into heavy atoms:
elementType: C C C C C C C C C C C C C C C C C C C C C C
charge: 0.064241 0.175816 0.175814 0.247302 0.451467 0.451474 -0.552133 -0.309646 0.334179 -0.109538 -0.109539 -0.141356 0.312472 -0.216688 -0.216687 -0.179044 -0.034562 -0.034567 -0.020070 -0.020069 -0.137859 -0.131007
polarizability: 3.04638334e+02 -1.06518539e-02 3.14920158e+02 5.42510352e+00 3.30799276e-03 1.44889607e+02
1716.lowfreq: -19.2233 -3.6956 -0.0007 -0.0006 0.0005 10.5159 10.5748 44.8967 57.6330
frequency: -19.1496 44.8852 57.6290 86.9648 105.4425 120.4108 140.1792 154.6616 175.4125 196.2094 215.1861 233.7174 285.9746 301.9041 317.4712 337.9822 389.6610 395.2090 406.4091 440.5322 442.8647 474.5557 501.0152 518.8372 528.9163 569.1279 594.4096 594.9999 623.6285 638.2064 642.4982 671.4584 729.1592 737.7090 752.4689 752.5412 772.9823 788.2593 819.6667 820.3402 855.5993 865.5871 874.1653 876.9072 898.0388 925.8476 933.3003 958.2571 959.3106 967.9093 974.6348 991.9494 992.1304 993.4196 1006.2680 1016.5437 1018.8401 1030.0355 1054.3311 1103.0457 1123.1695 1140.5178 1167.8848 1168.6265 1178.8888 1194.2244 1207.9749 1242.1579 1245.9591 1275.0868 1280.1468 1293.9186 1348.1983 1354.0675 1360.4093 1382.6558 1393.8564 1397.5118 1406.7879 1417.1778 1441.6382 1445.1054 1446.7639 1461.6503 1466.7938 1474.4430 1476.0677 1482.4075 1503.1303 1528.5844 1568.7401 1572.4340 1580.3478 1619.5749 1626.0715 1633.3491 2965.4390 2966.8200 3035.9588 3039.7817 3078.5886 3081.1740 3116.0608 3116.3208 3117.7118 3119.2626 3121.8043 3130.3108 3130.6744 3145.3430 3147.4690 3147.9514 3161.4508 3162.2614
redmass: 3.5823 4.2536 4.0316 4.7460 1.0710 3.7049 1.5557 1.6331 5.0399 4.3588 2.9382 4.6594 2.9332 3.9487 3.6786 3.9344 6.7046 3.1091 4.9418 2.8743 3.0213 2.7886 3.4522 4.5545 5.3058 2.9627 6.1917 5.2781 4.5631 6.0192 3.9218 5.9292 2.9163 4.2632 1.2756 3.4918 1.3445 5.6321 2.0529 1.6371 2.5534 1.6064 1.5565 4.4974 1.6383 3.9582 2.0734 1.3903 2.5941 1.3594 1.4421 1.4976 1.3222 1.4472 1.7169 2.4403 2.1666 1.4509 1.6390 2.2070 2.1225 1.6314 1.1094 1.4109 1.1243 1.2904 2.1416 2.8539 1.6487 2.0605 1.3225 1.9731 5.2469 2.8826 4.7851 1.7426 1.4074 2.3930 1.2995 4.0996 6.8650 2.9727 2.4013 1.0471 1.1649 1.0462 1.1862 2.5519 2.9146 6.8906 7.3699 6.4581 5.4729 6.4490 6.3834 6.1110 1.0375 1.0384 1.0969 1.0967 1.0984 1.0977 1.0880 1.0890 1.0858 1.0879 1.0915 1.0886 1.0886 1.0964 1.0948 1.0949 1.1000 1.1000
irintensity: 0.0110 0.3881 0.3352 1.3795 0.0006 0.0002 0.8007 0.4587 0.3387 0.5445 1.6457 0.0550 1.6607 1.3121 0.6078 1.1920 0.2198 1.2781 0.9754 4.0884 9.2234 0.0219 0.0000 2.9106 0.8086 6.6694 1.4766 0.9780 8.9622 0.5556 10.5946 0.4115 2.7762 4.8314 98.4057 0.0031 0.0066 2.9223 11.7434 20.5767 2.5707 25.4249 0.2312 14.8284 2.0544 0.7532 21.9603 0.1633 5.5123 0.0076 9.3122 1.3495 0.0008 1.0283 12.8124 1.8999 14.4719 12.7150 0.0209 0.3960 10.6280 3.8937 0.6115 4.8327 2.4596 1.8274 1.9035 0.1904 3.3509 0.0155 2.0258 0.1606 9.4297 0.8221 19.0011 1.7445 7.2236 12.4570 10.3332 5.7269 14.0425 0.4632 9.4861 0.0000 23.4108 27.4821 0.6021 3.5560 17.6595 4.3408 1.4318 3.8757 2.0570 3.5165 0.0299 1.5318 73.2122 12.5985 39.7465 0.0587 36.6797 5.1689 20.3448 1.6507 0.0031 9.7306 9.9812 1.6420 21.2137 12.6221 12.8276 48.1315 75.5160 0.0664
temp: 298.150 k
press: 1.00000 atm
elementType: 6 6 6 6 6 6 6 6 6 6 6 6 6 6 6 6 6 6 6 6 6 6 1 1 1 1 1 1 1 1 1 1 1 1 1 1 1 1 1 1
symmnumber: 1
zpe: 851539.6 jmol-1
zpe.correction: 0.324334 hartree
zpe.thermalcorrener: 0.341471 hartree
zpe.thermalcorrenthalpy: 0.342415 hartree
zpe.thermalcorrgfe: 0.280031 hartree
zpe.sumelectzpe: -847.680690 hartree
zpe.sumelectthermal: -847.663553 hartree
zpe.sumelectthermalent: -847.662609 hartree
zpe.sumelectthermalfe: -847.724994 hartree
dipole: -1.2820 0.0008 0.3160
dipole: 1.3204
quadrupole: -107.7175 -119.5047 -130.1962
quadrupole: -0.0037 0.3939 0.0012
quadrupole: 11.4220 -0.3652 -11.0567 -0.0037 0.3939 0.0012
hfenergy: -848.0050244 hartree
pointgroup: C01 [X(C22H18)]
dipole: 0.5034475 -0.0002795 0.128119 debye
polarizability: 304.7109351|-0.0114786|314.9201548|-4.2224446|0.0128057|144.8170096 unknown
InChI: InChI=1S/C22H18/c1-15-11-12-19(13-16(15)2)22-20-9-5-3-7-17(20)14-18-8-4-6-10-21(18)22/h3-14H,1-2H3
charge 0 multiplicity 1
40 atoms
C  -0.36288 -0.000189 -0.105351
C  -1.075923 1.237532 -0.048391
C  -1.075423 -1.238212 -0.048698
C  1.137199 0.000117 -0.217221
C  -2.531295 1.232479 0.066771
C  -2.530797 -1.233778 0.066457
C  -3.222544 -0.000796 0.121286
C  1.950319 0.000005 0.945019
C  3.364981 0.000264 0.873759
C  -0.401467 2.51467 -0.101727
C  -0.400449 -2.515062 -0.102366
C  1.774203 0.000559 -1.482646
C  3.998031 0.000688 -0.408042
C  -3.236543 2.490686 0.123215
C  -3.235535 -2.492286 0.122568
C  3.184619 0.000853 -1.56802
C  -1.114611 3.706622 -0.044632
C  -1.113107 -3.707319 -0.045588
C  -2.550802 3.697463 0.0696
C  -2.549303 -3.698771 0.06864
C  4.190558 -0.000151 2.147847
C  5.511056 0.000723 -0.529259
H  -4.316691 -0.001028 0.207723
H  1.465135 -0.000291 1.928796
H  1.166104 0.000688 -2.394317
H  0.689758 2.523733 -0.189159
H  0.690778 -2.523654 -0.189811
H  -4.329872 2.470076 0.209505
H  -4.328873 -2.472143 0.208853
H  3.663941 0.001215 -2.554754
H  -0.58961 4.667677 -0.086582
H  -0.587718 -4.668151 -0.087786
H  -3.091152 4.649864 0.112846
H  -3.089269 -4.651401 0.111627
H  3.545263 0.001466 3.043056
H  4.848641 -0.88897 2.208431
H  4.851548 0.886559 2.207247
H  5.960551 0.887444 -0.040998
H  5.960243 -0.887927 -0.044195
H  5.827734 0.002541 -1.586601
