program: Gaussian 09
title: 000256368
version: EM64L-G09RevD.01
frameworkgroup: C1[X(C17H18O3)]
method: RPBEPBE
basis: SDD
operation: Freq
keyword: #pfreq=noraman
keyword: PBEPBE/SDD
title: #p freq=noraman PBEPBE/SDD
converged: YES YES NO NO
title: Mulliken charges:
elementType: O O O C C C C C C C C C C C C C C C C C H H H H H H H H H H H H H H H H H H
charge: -0.231982 -0.269117 -0.258307 -0.569143 -0.526516 0.502388 0.120667 0.289915 -0.381311 -0.438930 -0.360902 -0.355070 0.313836 -0.319908 -0.354056 -0.372214 -0.357907 0.331473 -0.538236 -0.536762 0.230403 0.230200 0.245301 0.247402 0.233461 0.232364 0.247008 0.237127 0.249803 0.276285 0.253883 0.244898 0.219931 0.218725 0.243705 0.226267 0.226405 0.248917
chargesum: 0.00000
title: Mulliken charges with hydrogens summed into heavy atoms:
elementType: O O O C C C C C C C C C C C C C C C C C
charge: -0.231982 -0.269117 -0.258307 -0.108541 -0.033813 0.502388 0.120667 0.289915 -0.147850 -0.206567 -0.113894 -0.117943 0.313836 -0.070105 -0.077772 -0.118331 -0.113009 0.331473 0.144125 0.164827
polarizability: 3.06335009e+02 -5.78936806e+00 1.72746254e+02 -6.73526040e+00 -4.93333369e+00 1.32406956e+02
1716.lowfreq: -4.5583 -0.0010 -0.0009 -0.0008 3.1261 5.0443 19.5867 23.6569 29.5118
frequency: 19.4084 23.6486 29.4993 41.8417 79.8214 80.5426 97.9541 116.3932 137.6195 158.3751 194.3601 216.8359 223.8727 225.4701 254.6448 294.3791 313.8547 329.0918 365.4954 414.4964 414.9455 428.2224 440.0806 489.7191 502.2104 512.2342 543.9146 569.3486 579.0483 627.2164 633.4808 693.3942 723.1450 731.0571 759.9106 784.0635 795.1203 811.8695 825.5612 826.6111 843.2949 854.0599 936.0040 962.6415 963.5415 972.2214 983.2625 984.4704 989.1887 999.5715 1002.2424 1004.6221 1068.0250 1105.4193 1111.9078 1112.3458 1114.2849 1141.3647 1155.3880 1158.7950 1172.9088 1178.5583 1215.6361 1218.5587 1227.9855 1239.3807 1271.6708 1289.7524 1303.9472 1307.8963 1346.6661 1375.0827 1381.5533 1416.2879 1426.8207 1434.1884 1435.6506 1438.2738 1465.1539 1468.3981 1469.1123 1472.1353 1473.1576 1499.5706 1502.7710 1559.0163 1584.3683 1586.5623 1621.2535 1624.6392 2955.7791 2967.1783 2969.4606 3007.2183 3016.6711 3041.9729 3058.6465 3067.7108 3117.0269 3120.4133 3122.5641 3131.0818 3146.6762 3147.8925 3158.6716 3163.9388 3167.5213 3172.5292
redmass: 3.7935 3.7595 5.1842 4.2569 3.9568 4.5318 2.4545 4.5636 3.6412 4.4319 3.6216 3.0630 1.4161 1.3706 2.2162 3.4974 5.5816 2.7724 5.8208 2.9631 2.9547 4.7772 4.5030 2.9670 3.8004 4.3160 2.7513 2.1095 5.9808 7.1025 6.6978 5.3427 3.6719 2.9576 5.0062 1.5835 5.6843 1.5517 1.2560 1.5796 1.6433 2.8082 1.4264 1.4153 1.3782 4.3965 8.3641 1.5114 5.1390 2.0279 2.4781 2.5286 3.2885 1.3660 1.2603 1.2590 1.3409 1.1568 1.3280 1.3427 1.2581 1.2200 2.0597 1.8540 4.1322 3.2332 1.1843 1.9636 1.3067 1.3428 1.7934 4.9216 4.8005 3.3389 3.1678 1.1889 1.1702 1.1896 1.0505 1.0987 1.0495 1.0733 1.0733 2.4509 2.5060 7.7504 7.0093 7.4160 6.6599 6.4940 1.0331 1.0327 1.0600 1.0618 1.0969 1.1038 1.1043 1.1021 1.0895 1.0903 1.0977 1.1001 1.0880 1.0878 1.0936 1.0950 1.0952 1.0968
irintensity: 1.3523 0.0875 0.3911 1.3152 1.1286 0.7718 8.2245 6.5697 3.2950 0.8018 10.3028 3.8223 0.5210 0.4767 0.6388 1.9317 2.2636 1.4162 1.4953 0.0597 0.0925 6.5333 7.4797 5.9483 7.3252 27.1535 16.6029 11.6922 31.9723 2.8008 0.2400 2.6885 1.0418 0.9109 6.4332 22.5652 10.2495 33.6753 0.7920 15.6161 62.1264 20.7599 1.7085 5.9689 0.5744 104.6319 24.1747 1.3687 37.8630 9.8824 0.2336 6.3908 0.3120 10.3588 0.2144 0.1213 13.2203 3.8541 0.7221 0.2342 273.0729 24.4534 24.2725 88.1918 161.3981 170.4223 2.8629 168.7332 5.2031 26.0803 54.6006 65.3431 10.9614 2.3783 1.4202 12.3663 15.0757 2.5417 12.8777 14.7231 14.4437 62.1652 49.3327 31.8727 125.1925 98.2329 13.8901 163.1892 142.1444 37.4217 73.5786 72.9294 19.1014 17.0196 4.8968 52.0606 42.4722 17.4456 16.1405 39.8257 9.2312 22.6709 0.2343 8.8982 18.2086 5.1062 17.6556 4.9176
temp: 298.150 k
press: 1.00000 atm
elementType: 8 8 8 6 6 6 6 6 6 6 6 6 6 6 6 6 6 6 6 6 1 1 1 1 1 1 1 1 1 1 1 1 1 1 1 1 1 1
symmnumber: 1
zpe: 803360.1 jmol-1
zpe.correction: 0.305984 hartree
zpe.thermalcorrener: 0.325221 hartree
zpe.thermalcorrenthalpy: 0.326165 hartree
zpe.thermalcorrgfe: 0.255494 hartree
zpe.sumelectzpe: -882.802867 hartree
zpe.sumelectthermal: -882.783629 hartree
zpe.sumelectthermalent: -882.782685 hartree
zpe.sumelectthermalfe: -882.853357 hartree
dipole: -2.1860 -2.3210 -1.5167
dipole: 3.5307
quadrupole: -73.6013 -128.4773 -114.6366
quadrupole: -3.9683 -11.5724 1.3071
quadrupole: 31.9704 -22.9056 -9.0648 -3.9683 -11.5724 1.3071
hfenergy: -883.1088505 hartree
pointgroup: C01 [X(C17H18O3)]
dipole: 0.879379 -0.9692571 0.4656118 debye
polarizability: 305.9360707|8.4882949|171.0870954|-8.485839|9.586428|134.4650528 unknown
InChI: InChI=1S/C17H18O3/c1-19-15-8-3-13(4-9-15)5-12-17(18)14-6-10-16(20-2)11-7-14/h3-4,6-11H,5,12H2,1-2H3
charge 0 multiplicity 1
38 atoms
O  1.277102 2.613462 0.383797
O  -6.268389 -1.347556 -0.44835
O  6.080106 -1.672092 -0.224444
C  -1.330265 1.580944 0.201927
C  -0.11356 0.629711 0.10229
C  -2.647392 0.832049 0.065645
C  1.232259 1.357116 0.206795
C  2.491937 0.555149 0.095168
C  -3.123405 0.420242 -1.210224
C  -3.426742 0.496166 1.197443
C  -4.3236 -0.299177 -1.349553
C  -4.637678 -0.227872 1.082093
C  -5.085498 -0.628421 -0.199925
C  2.497717 -0.857246 -0.096689
C  3.739076 1.229111 0.182428
C  3.704175 -1.566149 -0.197852
C  4.957979 0.534505 0.082603
C  4.940218 -0.873193 -0.109481
C  -7.093656 -1.704317 0.706285
C  7.390838 -1.01638 -0.144782
H  -1.283267 2.117626 1.166312
H  -1.234027 2.3554 -0.581403
H  -0.149306 0.069925 -0.854469
H  -0.172027 -0.14043 0.898534
H  -2.548798 0.677949 -2.109049
H  -3.08845 0.809433 2.193113
H  -4.695052 -0.610619 -2.330834
H  -5.213221 -0.462854 1.982724
H  1.555106 -1.40935 -0.167576
H  3.723087 2.314323 0.330321
H  3.722733 -2.649988 -0.345333
H  5.901762 1.083138 0.153119
H  -7.450129 -0.802912 1.242741
H  -6.54311 -2.359088 1.410307
H  -7.952749 -2.249921 0.288727
H  7.532203 -0.522418 0.835485
H  7.518165 -0.277054 -0.958448
H  8.122757 -1.828411 -0.261543
