program: Gaussian 09
title: 000256367
version: EM64L-G09RevD.01
frameworkgroup: C1[X(C16H30O3)]
method: RPBEPBE
basis: SDD
operation: Freq
keyword: #pfreq=noraman
keyword: PBEPBE/SDD
title: #p freq=noraman PBEPBE/SDD
converged: NO YES NO NO
title: Mulliken charges:
elementType: O O O C C C C C C C C C C C C C C C C H H H H H H H H H H H H H H H H H H H H H H H H H H H H H H
charge: -0.270223 -0.280227 -0.249440 -0.016811 -0.481682 -0.415604 -0.457656 -0.431057 -0.301593 0.023195 -0.735306 -0.371275 -0.390417 -0.362693 -0.505843 -0.350873 0.255568 -0.357298 -0.694541 0.197598 0.237612 0.219838 0.215628 0.230239 0.221356 0.227616 0.258345 0.199840 0.186643 0.219878 0.242977 0.239329 0.229912 0.209798 0.201147 0.196908 0.207289 0.220651 0.185235 0.189342 0.230686 0.225385 0.193343 0.183145 0.198618 0.190992 0.212476 0.204430 0.217520
chargesum: 0.00000
title: Mulliken charges with hydrogens summed into heavy atoms:
elementType: O O O C C C C C C C C C C C C C C C C
charge: -0.270223 -0.280227 -0.249440 0.180787 -0.024233 0.030263 -0.008683 0.027128 0.104927 0.266172 -0.056267 0.026780 0.037523 0.011884 -0.049772 0.025615 0.255568 0.032312 -0.060115
polarizability: 2.04366016e+02 -1.53612723e+00 1.81623670e+02 -3.21576751e-01 -1.62801878e-02 1.53347373e+02
1716.lowfreq: -25.7553 -16.0830 -10.0563 -3.7487 -0.0005 -0.0003 0.0003 15.9819 20.3172
frequency: -22.9945 13.9594 19.9227 25.9616 35.1426 45.1846 59.1649 76.1580 81.7856 95.2117 115.6289 125.3864 137.2937 142.7516 157.3776 204.1024 212.7761 225.5001 233.2734 234.8552 248.2770 299.9509 329.5667 354.1455 394.2546 404.5524 422.4376 431.3106 476.0419 552.2953 574.2173 596.8487 649.6298 664.6837 720.0145 734.9255 754.8976 780.6642 784.6056 811.2607 844.2039 850.7683 859.7614 867.0808 882.1795 892.7854 897.6934 919.7955 922.3436 958.6718 972.0270 981.7840 990.2999 1014.9285 1026.9664 1027.2894 1033.0552 1036.7834 1063.3236 1077.8194 1090.6893 1097.4329 1112.7426 1113.5810 1127.4770 1145.7267 1158.4712 1169.9469 1170.8246 1195.1750 1199.9709 1214.7779 1225.6721 1242.8253 1246.2637 1255.5765 1274.0213 1278.5148 1281.3365 1282.7256 1290.8542 1297.4497 1303.6051 1311.0437 1316.1012 1327.8848 1331.0779 1336.5736 1337.7126 1352.0429 1353.8104 1361.1705 1368.8594 1387.5364 1392.3305 1449.0639 1455.4974 1458.0611 1460.2161 1462.1598 1465.0417 1466.4535 1469.2786 1473.1808 1476.9295 1477.6733 1480.8303 1482.1037 1487.0013 1488.7438 1629.8164 2944.7182 2948.1357 2952.0272 2955.5262 2959.5930 2964.2439 2970.1562 2973.3351 2983.8136 2986.2031 2992.3072 2994.7575 2996.4509 2998.1841 3008.1010 3009.0589 3013.1152 3020.6284 3030.7042 3032.5864 3051.4639 3060.4301 3061.1765 3064.4889 3070.6705 3071.9584 3084.0787 3084.5550 3090.8699 3101.5230
redmass: 2.6245 3.1271 3.7522 2.7633 2.8432 3.8415 3.7379 3.9495 3.4214 3.1878 1.8064 3.3546 2.2885 2.3229 2.8568 1.4139 2.5453 2.3393 1.7707 1.1584 3.0712 2.9117 2.8661 3.3887 3.4928 2.5090 2.8446 2.5036 3.3685 2.3590 3.3109 2.7861 3.9921 2.6483 1.0697 1.1645 1.8110 1.6494 1.5766 3.0269 2.4255 1.9834 2.1061 2.2752 1.5259 1.8257 1.7721 2.6715 2.4756 1.5503 1.5517 1.7858 2.6911 2.8525 1.6329 2.3337 2.1323 2.0992 2.2688 2.2943 1.9690 2.0838 1.8691 2.1158 1.6917 1.7652 1.6782 1.8782 1.7371 1.5448 1.4624 1.7947 1.3165 1.3549 1.3387 1.2690 1.2303 1.1574 1.0916 1.2445 1.2245 1.1586 1.2626 1.3136 1.2935 1.3222 1.4795 1.4165 1.3352 1.6182 1.5005 1.5807 1.4292 1.2168 1.2716 1.0915 1.0637 1.0857 1.0756 1.0694 1.0809 1.0667 1.0852 1.0763 1.0437 1.0919 1.0518 1.0803 1.0905 1.0937 10.2610 1.0689 1.0591 1.0591 1.0850 1.0600 1.0603 1.0363 1.0631 1.0951 1.0613 1.0572 1.0389 1.0982 1.0624 1.0618 1.0629 1.0998 1.0865 1.1037 1.0965 1.1034 1.1002 1.0980 1.1000 1.1010 1.0996 1.1014 1.1048 1.0988 1.1002
irintensity: 0.2876 0.3260 3.9579 0.1491 0.0186 0.5394 2.0132 0.6574 0.3648 0.8105 0.1888 1.2341 1.0566 0.4540 2.6726 0.2455 0.5262 2.4485 1.6381 0.0931 0.6818 1.7496 0.9147 9.2029 10.9499 0.3232 4.2941 1.7221 2.0028 0.9538 3.4288 0.5846 2.8197 4.6832 15.1635 0.0514 3.4721 1.4725 5.5681 10.0764 10.1314 7.1734 3.6820 14.9582 3.3258 1.5482 3.9269 8.6640 40.0477 15.6582 44.7588 2.8828 0.3549 52.6286 3.0553 11.3994 48.9589 43.6620 28.7849 3.4677 4.6411 46.0966 7.1376 5.4041 25.4891 20.5689 1.4381 45.7901 7.3576 3.4384 8.4929 97.5492 6.6063 7.0003 27.1482 12.4594 8.0702 1.0167 0.3367 13.3807 3.8550 3.2527 3.7668 1.6012 1.5644 3.0615 4.2877 0.8849 1.9174 4.3997 9.1215 2.3316 1.6523 13.1977 24.6456 16.1724 3.2354 7.6636 0.1071 6.4362 1.4933 5.9291 6.3396 1.2129 10.5725 9.8680 14.0997 3.6719 6.2469 21.8282 167.1970 99.7407 3.1321 3.4277 20.9456 1.4340 105.7560 37.2463 19.6147 7.1350 43.7280 20.9725 22.0595 1.4213 32.2124 27.7958 19.0048 1.8576 21.6887 91.2493 1.8588 95.0993 62.8871 38.9329 114.6259 15.5049 48.5682 30.5909 68.9951 27.6311 31.6595
temp: 298.150 k
press: 1.00000 atm
elementType: 8 8 8 6 6 6 6 6 6 6 6 6 6 6 6 6 6 6 6 1 1 1 1 1 1 1 1 1 1 1 1 1 1 1 1 1 1 1 1 1 1 1 1 1 1 1 1 1 1
symmnumber: 1
zpe: 1139169.6 jmol-1
zpe.correction: 0.433887 hartree
zpe.thermalcorrener: 0.456119 hartree
zpe.thermalcorrenthalpy: 0.457064 hartree
zpe.thermalcorrgfe: 0.378656 hartree
zpe.sumelectzpe: -851.818388 hartree
zpe.sumelectthermal: -851.796155 hartree
zpe.sumelectthermalent: -851.795211 hartree
zpe.sumelectthermalfe: -851.873619 hartree
dipole: 0.9288 -0.3936 -0.2357
dipole: 1.0359
quadrupole: -112.9370 -118.5993 -126.8492
quadrupole: -4.9268 5.4233 11.2778
quadrupole: 6.5249 0.8625 -7.3874 -4.9268 5.4233 11.2778
hfenergy: -852.2522748 hartree
pointgroup: C01 [X(C16H30O3)]
dipole: -0.3886348 -0.0858305 0.0877425 debye
polarizability: 204.1449457|-2.7177156|181.8367468|0.1102574|0.5212853|153.3553659 unknown
InChI: InChI=1S/C16H30O3/c1-3-4-5-6-7-10-16(17)19-14(2)11-12-15-9-8-13-18-15/h14-15H,3-13H2,1-2H3
charge 0 multiplicity 1
49 atoms
O  -0.26849 3.204627 1.016648
O  2.658444 -1.240838 0.388953
O  2.38098 -2.09881 -1.765776
C  0.494444 2.604097 -0.124752
C  -0.573539 2.030843 -1.093992
C  1.494781 1.580369 0.436403
C  -1.844973 2.854157 -0.764501
C  2.429633 1.011065 -0.655297
C  -1.717142 3.036676 0.760585
C  3.424035 -0.062132 -0.162017
C  4.355192 0.377343 0.970162
C  -0.928519 -2.236526 -0.064387
C  0.149483 -2.768391 0.90635
C  -2.143125 -1.62376 0.668468
C  1.42502 -3.2892 0.187674
C  -3.252525 -1.132725 -0.288902
C  2.185484 -2.184382 -0.529662
C  -4.428388 -0.442901 0.440168
C  -5.532278 0.045923 -0.522186
H  1.045156 3.439827 -0.606589
H  -0.272836 2.116835 -2.151692
H  -0.74557 0.959941 -0.871918
H  0.932941 0.758741 0.920984
H  2.083922 2.080326 1.227596
H  -2.777561 2.338925 -1.054958
H  -1.8123 3.835219 -1.272597
H  1.837233 0.571105 -1.479602
H  3.026883 1.83412 -1.100545
H  -2.094297 2.140881 1.299867
H  -2.22806 3.933826 1.149764
H  3.99972 -0.434475 -1.031005
H  3.787383 0.622584 1.883365
H  5.071288 -0.425162 1.215951
H  4.926252 1.272471 0.66296
H  -0.483939 -1.471084 -0.733874
H  -1.268139 -3.060055 -0.726018
H  -0.27588 -3.596985 1.506376
H  0.442258 -1.973254 1.618078
H  -1.797575 -0.775179 1.296783
H  -2.568816 -2.372586 1.368998
H  2.100808 -3.74778 0.9337
H  1.162741 -4.053876 -0.563716
H  -3.637894 -1.991088 -0.877664
H  -2.816177 -0.425923 -1.026474
H  -4.863954 -1.147481 1.177761
H  -4.038655 0.415685 1.026072
H  -5.960121 -0.797735 -1.095783
H  -5.129321 0.774315 -1.25213
H  -6.358702 0.537229 0.023567
