program: Gaussian 09
title: 000256366
version: EM64L-G09RevD.01
frameworkgroup: C1[X(C16H16O)]
method: RPBEPBE
basis: SDD
operation: Freq
keyword: #pfreq=noraman
keyword: PBEPBE/SDD
title: #p freq=noraman PBEPBE/SDD
converged: YES YES NO NO
title: Mulliken charges:
elementType: O C C C C C C C C C C C C C C C C H H H H H H H H H H H H H H H H
charge: -0.225150 -0.567245 -0.526312 0.492322 0.121375 0.288382 -0.416573 -0.416316 -0.338875 -0.346786 0.441101 -0.400126 -0.385334 -0.229588 -0.229632 -0.244369 -0.804854 0.231510 0.231128 0.247986 0.248385 0.233505 0.233558 0.245913 0.275900 0.233298 0.235017 0.223397 0.223414 0.226828 0.229177 0.228280 0.240686
chargesum: 0.00000
title: Mulliken charges with hydrogens summed into heavy atoms:
elementType: O C C C C C C C C C C C C C C C C
charge: -0.225150 -0.104608 -0.029941 0.492322 0.121375 0.288382 -0.183068 -0.182758 -0.092962 -0.070886 0.441101 -0.166828 -0.150317 -0.006191 -0.006218 -0.017541 -0.106711
polarizability: 2.44116853e+02 -7.96427278e+00 1.56475133e+02 -6.96015108e-01 -3.57962715e-01 1.22412636e+02
1716.lowfreq: -12.6470 -7.3721 -4.0011 -0.0003 0.0002 0.0003 2.9603 10.9652 26.2201
frequency: -11.7907 8.3571 26.1407 41.5335 47.3384 88.7352 117.0261 128.9090 199.6596 241.1843 262.6882 329.0272 331.3995 343.5166 402.0775 404.0716 449.2682 460.9723 518.3984 547.7428 570.1810 596.5946 617.5475 633.8804 705.0038 722.3740 735.4012 760.6737 780.5142 798.6232 834.3201 843.1738 853.0795 861.8349 917.8358 964.8957 969.8301 974.6409 989.6387 990.4162 991.4328 993.5052 1003.4665 1012.8305 1026.0897 1046.9865 1067.2639 1080.4507 1123.6017 1138.4790 1171.2685 1185.7592 1190.3869 1212.8641 1217.8112 1226.3066 1273.3075 1289.5185 1308.8164 1325.9541 1345.9428 1372.9031 1381.7006 1397.5836 1411.6679 1436.1150 1439.5598 1468.7328 1470.8292 1472.7727 1483.5531 1503.3779 1561.6851 1592.4033 1593.0990 1614.4808 1621.8947 2970.9402 2976.5163 3012.3997 3017.8569 3058.4204 3072.0510 3088.8686 3113.2569 3113.3515 3123.9772 3127.1835 3130.5088 3141.8146 3150.8772 3158.5156 3161.2339
redmass: 1.0472 3.5666 3.7082 4.9041 4.1392 3.7486 2.5761 4.7430 6.0216 4.6866 3.8615 2.3497 4.0354 3.5492 2.8234 2.8389 4.4578 2.7660 3.7469 4.7670 2.1506 5.2345 6.3312 6.9363 1.8383 2.8907 4.0104 2.0537 1.3927 5.0857 1.4253 3.4752 1.2489 1.2680 1.5272 1.3770 3.6050 1.3879 5.6123 1.7165 1.5328 1.3938 1.4439 2.7843 2.1892 1.5905 3.2976 1.5700 1.3144 1.1588 1.0515 1.1140 1.1898 2.2907 2.2382 2.5157 1.1836 2.0239 1.3100 1.2523 1.7226 4.6896 7.8840 1.2217 3.5741 1.0946 2.1835 1.1040 1.1087 1.0567 2.3156 2.5936 6.4247 6.0590 7.6291 6.1876 6.4672 1.0602 1.0390 1.0605 1.0978 1.0944 1.1028 1.1000 1.0872 1.0868 1.0881 1.0890 1.0906 1.0958 1.0953 1.0958 1.1014
irintensity: 0.5954 0.1896 0.2540 0.4302 1.1192 1.9514 1.9101 0.0479 3.1128 8.2295 1.1766 0.1207 0.4155 3.8260 0.0014 0.0465 0.3115 11.0380 30.8297 6.5118 9.2316 4.2087 0.0586 0.7635 46.6824 0.3981 19.5603 32.0884 27.7361 0.6732 25.2893 1.6452 0.0075 7.6291 0.9712 1.5354 59.9793 0.0077 0.3083 2.9324 5.9939 5.0181 0.6603 0.5732 7.9543 22.8348 0.2038 8.8917 13.0902 1.0919 0.0985 2.5436 72.6507 48.9484 0.4997 2.8146 0.1489 159.4704 6.6713 0.1689 39.2870 13.7623 0.2156 13.9321 14.6681 11.7747 6.8399 13.3581 17.4713 13.1983 21.4170 0.1356 91.3960 1.3023 90.4157 20.5923 39.3052 24.7295 25.1157 15.6735 4.4796 20.9428 16.1516 16.0205 8.6083 9.8099 12.6041 18.4482 9.9840 46.6431 18.2642 5.9529 25.6246
temp: 298.150 k
press: 1.00000 atm
elementType: 8 6 6 6 6 6 6 6 6 6 6 6 6 6 6 6 6 1 1 1 1 1 1 1 1 1 1 1 1 1 1 1 1
symmnumber: 1
zpe: 709030.7 jmol-1
zpe.correction: 0.270056 hartree
zpe.thermalcorrener: 0.284997 hartree
zpe.thermalcorrenthalpy: 0.285941 hartree
zpe.thermalcorrgfe: 0.224157 hartree
zpe.sumelectzpe: -693.327864 hartree
zpe.sumelectthermal: -693.312923 hartree
zpe.sumelectthermalent: -693.311979 hartree
zpe.sumelectthermalfe: -693.373763 hartree
dipole: -1.9120 -3.4178 0.0540
dipole: 3.9166
quadrupole: -83.0591 -105.3545 -97.3252
quadrupole: 0.3512 -0.4130 -0.1813
quadrupole: 12.1871 -10.1082 -2.0789 0.3512 -0.4130 -0.1813
hfenergy: -693.5979198 hartree
pointgroup: C01 [X(C16H16O1)]
dipole: 0.7371381 -1.352422 -0.0447935 debye
polarizability: 244.2850628|6.9905235|156.2839204|-0.4880584|0.9721981|122.4356378 unknown
InChI: InChI=1S/C16H16O/c1-13-7-10-15(11-8-13)16(17)12-9-14-5-3-2-4-6-14/h2-8,10-11H,9,12H2,1H3
charge 0 multiplicity 1
33 atoms
O  0.753041 2.447563 0.037452
C  -1.791351 1.262973 0.013158
C  -0.525505 0.372492 0.008034
C  -3.062286 0.426783 0.003537
C  0.777461 1.180096 0.020878
C  2.084409 0.440111 0.013749
C  -3.659119 0.023821 -1.219479
C  -3.661109 -0.000701 1.21724
C  2.166624 -0.978396 -0.006399
C  3.2918 1.190537 0.03092
C  4.628382 -0.876135 0.002419
C  3.420555 -1.622318 -0.010323
C  4.539929 0.542553 0.02721
C  -4.818131 -0.784892 -1.23176
C  -4.820094 -0.809486 1.211425
C  -5.402522 -1.206615 -0.01476
C  5.975616 -1.572877 -0.034183
H  -1.757782 1.918303 0.902166
H  -1.754438 1.933447 -0.864348
H  -0.531679 -0.289793 -0.881664
H  -0.537346 -0.307808 0.883984
H  -3.216941 0.355445 -2.167747
H  -3.22049 0.311843 2.172686
H  1.255353 -1.585693 -0.015377
H  3.217165 2.283077 0.050533
H  3.467429 -2.717932 -0.022309
H  5.461341 1.13707 0.044611
H  -5.267896 -1.080442 -2.18669
H  -5.271373 -1.124164 2.159505
H  -6.303316 -1.830662 -0.021772
H  6.754605 -0.975777 0.471101
H  5.933707 -2.56509 0.448146
H  6.308763 -1.729531 -1.078843
