program: Gaussian 09
title: 000256357
version: EM64L-G09RevD.01
frameworkgroup: C1[X(C13H21NO)]
method: RPBEPBE
basis: SDD
operation: Freq
keyword: #p
keyword: freq=noraman
keyword: PBEPBE/SDD
title: #p freq=noraman PBEPBE/SDD
converged: YES YES NO NO
title: Mulliken charges:
elementType: O N C C C C C C C C C C C C C H H H H H H H H H H H H H H H H H H H H H
charge: -0.278643 -0.154169 -0.372882 -0.234385 -0.346138 0.480676 -0.401743 0.405167 -0.385298 -0.473606 -0.350264 -0.353810 -0.687648 -0.648204 -0.647777 0.207542 0.202955 0.177404 0.173470 0.191390 0.190790 0.198154 0.186990 0.242028 0.221553 0.232222 0.232599 0.211321 0.211942 0.214278 0.231471 0.232665 0.213556 0.231486 0.213950 0.230959
chargesum: 0.00000
title: Mulliken charges with hydrogens summed into heavy atoms:
elementType: O N C C C C C C C C C C C C C
charge: -0.278643 -0.154169 0.037615 0.116489 0.036042 0.480676 -0.016599 0.405167 -0.143270 -0.252053 -0.118043 -0.121212 -0.050108 0.029488 0.028618
polarizability: 2.31891212e+02 -1.07643473e+01 1.45282787e+02 -1.20184453e+01 -7.64997999e+00 1.01979427e+02
1716.lowfreq: -9.3569 -0.0010 -0.0008 -0.0007 2.3679 6.3101 14.7198 26.1366 35.7895
frequency: 13.6741 25.8615 35.7777 62.2451 76.7050 81.5214 106.9722 114.6515 124.2190 151.5466 199.6879 210.0538 223.5399 231.7781 245.1601 314.6991 342.1740 363.2347 417.3389 440.2555 453.7830 481.6516 515.1151 555.4222 635.6077 701.5471 725.9246 741.1797 803.8082 808.6268 809.8108 825.5264 885.3277 920.7399 931.9651 937.4393 944.3547 953.8803 997.1474 1000.4982 1017.2222 1052.1608 1058.1320 1083.4592 1109.3490 1111.2710 1123.1390 1130.9735 1146.5486 1164.6116 1190.9850 1198.3700 1210.8177 1239.5178 1265.2353 1268.1017 1272.3272 1282.5076 1315.6304 1335.4426 1351.2758 1358.1934 1380.2293 1388.9120 1404.4674 1424.7676 1437.2201 1458.9558 1463.7600 1467.3630 1470.5149 1473.8565 1475.9254 1477.0609 1484.9560 1491.8834 1494.6837 1507.8098 1531.3943 1570.1502 1637.2371 2887.5252 2899.0554 2930.7814 2939.8053 2940.9102 2947.7980 2963.9695 2973.8437 2990.6646 2993.8482 2996.5081 3007.1880 3053.2444 3072.5056 3072.9416 3090.3936 3100.5999 3113.0245 3137.5751 3160.6269 3165.1823
redmass: 3.0339 1.8818 3.6208 3.3932 2.8227 2.5298 1.9491 2.3534 2.7312 2.4367 3.2829 1.1403 2.0428 1.1207 2.9649 3.2710 3.2238 3.6194 2.9409 2.9245 4.0252 3.4385 2.6420 3.4060 7.0243 3.4359 3.5704 1.0734 1.6058 1.2777 1.3449 3.4443 2.6175 1.8665 1.5062 1.3309 2.9757 1.3623 2.3217 2.3359 4.0635 4.7066 1.4848 2.1661 1.3099 1.2460 2.5924 1.4268 1.4176 1.7262 1.1653 1.1100 1.3708 2.0940 2.8933 1.2821 1.1685 1.0838 1.3912 1.3633 1.6309 3.3178 3.3479 1.2596 1.6465 1.8800 1.5441 1.2122 1.0406 1.0816 1.0739 1.0463 1.0723 1.0430 1.0697 1.0875 1.0830 1.0977 2.7570 6.6852 6.2706 1.0591 1.0564 1.0370 1.0404 1.1039 1.0989 1.0587 1.0363 1.0593 1.0987 1.1028 1.1005 1.1038 1.1011 1.0995 1.0956 1.0936 1.0891 1.0875 1.0931 1.0946
irintensity: 0.4843 1.7811 1.1768 1.1218 5.8335 2.2101 0.7803 4.2894 3.6523 0.5360 0.8600 0.1651 0.5739 0.0298 0.9779 0.7437 6.4558 0.0501 1.4629 0.5592 2.6210 6.3732 11.0371 9.2572 0.2596 2.5307 0.3398 8.8565 45.8701 9.5940 18.5995 19.9945 6.5679 16.0287 2.8760 1.0838 21.3342 0.1085 0.2554 33.1797 67.4181 136.7313 25.5104 7.0531 1.1678 0.1865 3.3795 5.3910 2.1989 10.6903 36.4695 11.5328 0.5060 1.0313 34.1247 0.5702 0.2075 0.1192 39.8768 42.6945 40.7226 100.5382 15.7964 6.9499 7.0803 4.3702 0.3200 8.6213 0.2065 4.6646 0.7856 20.3401 4.0568 12.3944 5.2640 11.4828 1.8566 36.5273 236.1242 7.5864 168.1458 20.6793 141.2831 121.3020 90.8205 64.7800 41.9154 40.5193 35.0558 39.8671 2.5130 100.5227 7.9714 23.5544 97.5470 57.8368 4.7662 51.9155 19.9025 10.2771 31.7324 7.3704
temp: 298.150 k
press: 1.00000 atm
elementType: 8 7 6 6 6 6 6 6 6 6 6 6 6 6 6 1 1 1 1 1 1 1 1 1 1 1 1 1 1 1 1 1 1 1 1 1
symmnumber: 1
zpe: 820487.9 jmol-1
zpe.correction: 0.312507 hartree
zpe.thermalcorrener: 0.329974 hartree
zpe.thermalcorrenthalpy: 0.330918 hartree
zpe.thermalcorrgfe: 0.264172 hartree
zpe.sumelectzpe: -636.754436 hartree
zpe.sumelectthermal: -636.736969 hartree
zpe.sumelectthermalent: -636.736025 hartree
zpe.sumelectthermalfe: -636.802771 hartree
dipole: -1.8083 -0.1976 -0.5478
dipole: 1.8998
quadrupole: -67.1184 -85.6276 -95.1962
quadrupole: -5.7461 -4.6093 -2.2784
quadrupole: 15.5290 -2.9802 -12.5488 -5.7461 -4.6093 -2.2784
hfenergy: -637.0669429 hartree
pointgroup: C01 [X(C13H21N1O1)]
dipole: 0.7139913 -0.0830279 0.2048589 debye
polarizability: 231.7390081|8.8123927|145.4318586|-14.7396184|6.1005596|101.9825596 unknown
InChI: InChI=1S/C13H21NO/c1-4-5-10-15-11-12-6-8-13(9-7-12)14(2)3/h6-9H,4-5,10-11H2,1-3H3
charge 0 multiplicity 1
36 atoms
O  -2.103003 -0.290715 -0.016742
N  4.300813 0.472777 -0.322481
C  -4.388169 0.476053 -0.285797
C  -3.491596 -0.58801 0.354232
C  -5.882043 0.279316 0.062159
C  0.258364 -0.809359 0.288869
C  -1.157213 -1.26907 0.553614
C  2.977902 0.052559 -0.126654
C  0.648388 0.529856 0.540995
C  1.246022 -1.704116 -0.185556
C  1.971466 0.960207 0.337885
C  2.57972 -1.296274 -0.388095
C  -6.78726 1.348351 -0.5871
C  4.671609 1.869895 -0.075316
C  5.306307 -0.477787 -0.806806
H  -4.247755 0.44733 -1.38357
H  -4.050334 1.474907 0.052792
H  -3.59921 -0.577576 1.464607
H  -3.775754 -1.605053 -0.003502
H  -6.010805 0.305865 1.163743
H  -6.208648 -0.728943 -0.266033
H  -1.331139 -2.273609 0.107474
H  -1.354328 -1.350097 1.649211
H  -0.108333 1.246314 0.879421
H  0.972857 -2.74407 -0.407356
H  2.222434 2.005837 0.538475
H  3.304799 -2.026388 -0.759041
H  -6.503255 2.363618 -0.252032
H  -6.700366 1.323479 -1.68957
H  -7.850131 1.190495 -0.327094
H  4.495122 2.1644 0.980041
H  4.103087 2.571024 -0.721302
H  5.743553 2.00829 -0.288724
H  5.420984 -1.341296 -0.119365
H  6.28329 0.026014 -0.879765
H  5.05332 -0.876624 -1.811616
