program: Gaussian 09
title: 000264462
version: EM64L-G09RevD.01
frameworkgroup: C1[X(C20H15FO)]
method: RPBEPBE
basis: SDD
operation: Freq
keyword: #p
keyword: freq=noraman
keyword: PBEPBE/SDD
title: #p freq=noraman PBEPBE/SDD
converged: YES YES NO NO
title: Mulliken charges:
elementType: F O C C C C C C C C C C C C C C C C C C C C H H H H H H H H H H H H H H H
charge: -0.206369 -0.275661 -0.328898 -0.346405 0.219227 0.222678 0.570093 0.517413 -0.409586 -0.399984 -0.225580 -0.231257 -0.447869 -0.329064 -0.417978 -0.353341 -0.365159 -0.364903 -0.232265 -0.240830 0.313409 -0.239455 0.228014 0.231567 0.249499 0.249682 0.229254 0.229538 0.238541 0.249848 0.232763 0.241199 0.255050 0.254073 0.227550 0.225689 0.229516
chargesum: 0.00000
title: Mulliken charges with hydrogens summed into heavy atoms:
elementType: F O C C C C C C C C C C C C C C C C C C C C
charge: -0.206369 -0.275661 -0.100883 -0.114838 0.219227 0.222678 0.570093 0.517413 -0.160087 -0.150302 0.003674 -0.001719 -0.209328 -0.079216 -0.185215 -0.112143 -0.110109 -0.110830 -0.004715 -0.015141 0.313409 -0.009939
polarizability: 2.71730095e+02 8.34690312e+00 1.89665452e+02 7.49237690e+00 1.88344119e-01 1.71069436e+02
1716.lowfreq: -7.0716 -2.8140 -0.0006 -0.0005 0.0005 8.5003 20.2108 22.9731 29.0858
frequency: 20.1419 22.6000 29.0277 40.7845 67.6656 72.9055 143.9883 161.2411 176.4269 230.7021 248.7702 265.5276 315.4645 350.0786 384.6699 403.2447 410.3791 414.9808 448.4714 474.1501 498.1739 525.7780 548.6514 573.2367 597.7654 616.2284 622.0928 647.9135 683.7206 703.9506 710.0046 722.3787 749.6469 769.2293 779.0786 814.4887 817.0237 827.5804 833.3021 854.7698 863.2228 874.5146 877.8882 897.6807 918.2640 933.7661 947.2057 954.7612 959.7887 979.0066 990.8529 991.2927 997.3588 1006.5667 1022.6740 1026.8005 1081.8573 1095.9969 1102.9872 1154.4020 1167.5641 1170.7354 1172.9571 1189.1495 1192.4113 1194.9289 1204.0003 1223.5015 1233.9584 1268.1244 1279.4720 1283.5557 1292.8783 1316.3796 1341.4841 1386.3656 1391.8738 1393.9993 1412.4865 1442.6393 1446.5698 1469.1328 1483.2342 1495.4121 1594.2582 1598.5594 1605.2610 1612.0804 1612.6378 1617.5832 2937.6808 3001.1165 3118.2169 3121.8991 3127.0777 3132.7920 3134.5883 3135.0949 3145.9648 3147.3315 3148.3988 3162.9808 3164.5565 3174.1632 3176.9403
redmass: 6.0666 3.9979 3.8737 6.7956 5.1518 4.8538 6.8607 5.0826 5.8593 6.1250 4.9150 5.2302 6.6521 5.9989 5.5418 2.8082 3.0274 3.1415 3.9913 4.3584 4.3829 5.8131 3.9300 3.9209 5.5829 6.2485 6.7450 5.6734 5.7362 1.7108 4.6985 3.7704 1.8073 1.9074 3.3914 2.2891 1.3371 2.4187 3.5931 1.2730 2.8159 3.9723 2.0628 2.7319 3.2666 1.8929 1.4840 1.4388 1.3684 1.4067 1.5679 3.4514 1.3206 2.7527 2.1971 2.2281 1.6721 2.0195 1.3433 1.4545 2.1727 1.1015 1.0591 1.1133 1.9903 2.0717 1.9770 1.6492 1.3705 1.6781 1.5105 1.4397 1.5435 1.8112 1.3512 6.8248 6.8396 6.4442 2.5129 2.2136 2.3359 2.8176 2.2829 2.7379 6.2593 6.9856 7.5749 6.4809 6.0983 7.0286 1.0834 1.0855 1.0864 1.0869 1.0854 1.0901 1.0913 1.0897 1.0961 1.0950 1.0892 1.1015 1.1005 1.0956 1.0964
irintensity: 0.3719 0.1075 0.0261 0.0738 0.6575 0.0238 0.4798 0.5528 2.2383 4.0773 1.8486 0.3862 2.9163 0.3014 2.1153 0.0080 2.0886 2.1381 4.0035 2.2493 10.9007 28.6397 13.1791 6.7720 6.1653 2.1322 6.1404 23.2505 2.4192 48.0764 1.5152 1.8793 57.4701 77.0061 22.0561 55.4185 1.6042 40.3992 2.9143 1.0816 8.4672 3.7793 1.9328 1.1945 118.8440 27.0281 10.3652 4.7319 0.3568 0.0960 0.3803 0.5178 0.1135 8.8260 5.0831 5.4421 7.4700 1.1424 14.0486 53.1123 4.9128 0.6941 0.1387 2.9232 16.5421 6.0389 22.4838 17.8474 9.2677 20.3476 13.6538 2.5264 4.7780 11.8217 1.7702 0.2901 2.2614 2.7954 4.3564 17.3863 7.6213 6.0690 12.3043 93.5023 0.4490 0.6046 6.8610 23.8416 4.2422 7.3635 30.2345 24.4078 6.0493 1.6078 0.8531 9.0502 11.1092 4.1575 39.1862 24.7231 6.5218 30.8077 26.5610 4.9788 3.1307
temp: 298.150 k
press: 1.00000 atm
elementType: 9 8 6 6 6 6 6 6 6 6 6 6 6 6 6 6 6 6 6 6 6 6 1 1 1 1 1 1 1 1 1 1 1 1 1 1 1
symmnumber: 1
zpe: 754694.8 jmol-1
zpe.correction: 0.287448 hartree
zpe.thermalcorrener: 0.304807 hartree
zpe.thermalcorrenthalpy: 0.305751 hartree
zpe.thermalcorrgfe: 0.239041 hartree
zpe.sumelectzpe: -944.678853 hartree
zpe.sumelectthermal: -944.661494 hartree
zpe.sumelectthermalent: -944.660550 hartree
zpe.sumelectthermalfe: -944.727260 hartree
dipole: -2.6648 2.1792 0.8167
dipole: 3.5380
quadrupole: -133.1906 -122.5308 -115.3865
quadrupole: 5.5423 4.0524 -1.7662
quadrupole: -9.4879 1.1718 8.3161 5.5423 4.0524 -1.7662
hfenergy: -944.9663011 hartree
pointgroup: C01 [X(C20H15F1O1)]
dipole: 1.0303765 -0.8822185 0.3123067 debye
polarizability: 272.2025672|7.4888772|189.4390679|-5.0711611|0.724585|170.8233481 unknown
InChI: InChI=1S/C20H15FO/c21-16-12-10-15(11-13-16)20-18-9-5-4-8-17(18)19(22-20)14-6-2-1-3-7-14/h1-13,19-20H
charge 0 multiplicity 1
37 atoms
F  -6.16597 1.305669 -0.410784
O  0.202625 0.996549 -0.497022
C  -0.612608 0.210256 0.483579
C  1.370901 0.165127 -0.962808
C  -0.165157 -1.228617 0.252292
C  0.97726 -1.250734 -0.577806
C  -2.08593 0.497564 0.248035
C  2.673294 0.675429 -0.35109
C  -0.71943 -2.423227 0.751274
C  1.592214 -2.469755 -0.92305
C  -0.109985 -3.652421 0.401539
C  1.038107 -3.675311 -0.428766
C  -2.862573 1.124941 1.250615
C  -2.697293 0.15018 -0.984132
C  3.446729 1.626962 -1.060731
C  3.107821 0.257621 0.932843
C  -4.233973 1.399739 1.044525
C  -4.061574 0.417541 -1.214643
C  4.629971 2.157646 -0.500678
C  4.288481 0.787353 1.496503
C  -4.799005 1.036236 -0.18791
C  5.053621 1.739324 0.781826
H  -0.342425 0.539516 1.510734
H  1.406975 0.309987 -2.059814
H  -1.611912 -2.40376 1.386643
H  2.48502 -2.487239 -1.557884
H  -0.529673 -4.593841 0.773146
H  1.498245 -4.634189 -0.691894
H  -2.393895 1.409849 2.1999
H  -2.095817 -0.324874 -1.766088
H  3.114171 1.958668 -2.052374
H  2.526847 -0.489899 1.48597
H  -4.848093 1.885691 1.807852
H  -4.550187 0.160092 -2.158832
H  5.218696 2.893151 -1.060214
H  4.615907 0.457088 2.488913
H  5.971718 2.147785 1.21903
