program: Gaussian 09
title: 000256356
version: EM64L-G09RevD.01
frameworkgroup: C1[X(C13H11N3O4)]
method: RPBEPBE
basis: SDD
operation: Freq
keyword: #p
keyword: freq=noraman
keyword: PBEPBE/SDD
title: #p freq=noraman PBEPBE/SDD
converged: NO YES NO NO
title: Mulliken charges:
elementType: O O O O N N N C C C C C C C C C C C C C H H H H H H H H H H H
charge: -0.187416 -0.261730 -0.213655 -0.206466 -0.467660 0.023660 0.015589 0.324253 0.420076 0.231860 -0.309059 -0.502839 0.446318 -0.415326 -0.372405 0.441605 -0.404101 -0.356018 -0.378509 -0.801638 0.355083 0.287186 0.336428 0.251375 0.270051 0.292908 0.239444 0.239422 0.229595 0.229383 0.242585
chargesum: 0.00000
title: Mulliken charges with hydrogens summed into heavy atoms:
elementType: O O O O N N N C C C C C C C C C C C C C
charge: -0.187416 -0.261730 -0.213655 -0.206466 -0.112577 0.023660 0.015589 0.324253 0.420076 0.231860 -0.021873 -0.166411 0.446318 -0.163951 -0.102354 0.441605 -0.111193 -0.116574 -0.139087 -0.100075
polarizability: 3.75860980e+02 -9.29774619e-02 2.10451538e+02 -8.81056488e+00 -7.66110604e+00 8.94255276e+01
1716.lowfreq: -0.0006 -0.0004 -0.0004 3.5331 5.2030 8.0438 25.8733 35.6557 40.1494
frequency: 25.7321 35.6001 40.0977 52.3942 61.1057 79.4406 125.8522 145.3966 164.2801 174.3155 203.1148 257.8836 299.8654 319.3889 333.1687 368.3879 382.1340 408.5554 424.6681 444.7972 485.1878 501.5552 514.3315 522.8951 605.1525 628.7577 647.8411 654.7220 666.9085 704.5281 709.6812 721.9265 749.8106 770.7520 796.8990 818.2051 831.5767 838.0396 854.0709 862.8947 899.2322 955.2034 966.8688 973.1469 990.7694 1003.4888 1009.8885 1047.4659 1050.5597 1104.0428 1128.1185 1144.3848 1163.2484 1192.8945 1206.2842 1226.4402 1233.5082 1246.2818 1301.4580 1317.5204 1343.5249 1360.8497 1365.6318 1384.0134 1400.8363 1417.5720 1451.6240 1470.6657 1474.1836 1490.0039 1505.6317 1525.7870 1578.5684 1593.6815 1616.9617 1629.1461 2978.5769 3060.3192 3090.0515 3128.7536 3130.9706 3151.1969 3159.2319 3173.8175 3187.0414 3191.4352 3226.9575
redmass: 1.0834 4.5849 4.4361 6.4834 9.6484 8.7210 6.3874 5.8531 8.0764 5.7934 6.9234 5.1756 6.5679 8.8527 3.2791 7.8520 5.8453 2.9701 4.8510 4.3532 7.3177 3.7982 3.4556 4.6536 6.0201 6.4753 7.3006 6.9913 9.2208 7.2867 3.5809 4.9484 9.8414 4.6465 3.0038 1.4013 1.3851 2.3054 1.6862 1.8195 5.7095 1.3113 1.4033 1.3670 1.3970 1.3394 2.6894 1.5653 2.2372 3.9608 1.3323 1.4748 7.6508 1.1644 3.4678 2.8834 4.0180 1.7183 1.8416 1.5895 4.8262 4.9668 4.8731 6.0081 1.2172 3.2239 5.4934 1.1240 1.0558 3.2475 2.5695 3.4347 6.2572 3.3249 6.5479 6.6053 1.0390 1.0947 1.1000 1.0881 1.0886 1.0968 1.0963 1.0884 1.0919 1.0970 1.0782
irintensity: 0.4994 0.5023 0.7933 0.0684 0.7514 0.3840 2.8950 1.1550 4.2445 2.4004 0.0383 1.3443 1.0249 0.4469 0.8864 0.4135 0.7288 0.1967 0.9486 0.1979 19.7538 10.8590 20.9101 3.9966 5.4693 3.5279 11.6253 9.6990 11.1658 8.0283 0.8493 2.7175 5.9369 11.9225 18.0613 20.2242 48.6830 41.8563 29.0939 17.8007 5.9420 2.9815 26.7954 0.6818 0.4537 1.3635 5.2226 27.0572 11.9067 51.7003 22.4929 11.3967 387.2937 1.5602 518.2026 1.4022 142.7602 25.3860 64.2819 36.8080 210.4078 50.3739 26.0141 19.5013 11.0495 1.4155 4.8531 12.7619 13.7925 103.7144 83.6844 110.2824 56.8525 102.0745 126.8115 254.4027 33.8272 19.6162 15.5521 9.6432 24.1423 14.9478 1.8014 2.0036 17.5420 3.4391 117.0805
temp: 298.150 k
press: 1.00000 atm
elementType: 8 8 8 8 7 7 7 6 6 6 6 6 6 6 6 6 6 6 6 6 1 1 1 1 1 1 1 1 1 1 1
symmnumber: 1
zpe: 589039.7 jmol-1
zpe.correction: 0.224353 hartree
zpe.thermalcorrener: 0.241650 hartree
zpe.thermalcorrenthalpy: 0.242594 hartree
zpe.thermalcorrgfe: 0.176665 hartree
zpe.sumelectzpe: -965.570259 hartree
zpe.sumelectthermal: -965.552962 hartree
zpe.sumelectthermalent: -965.552018 hartree
zpe.sumelectthermalfe: -965.617947 hartree
dipole: 9.1426 -2.0130 -0.4311
dipole: 9.3716
quadrupole: -127.1295 -130.7572 -113.4167
quadrupole: -8.0638 -0.2855 -5.5850
quadrupole: -3.3617 -6.9894 10.3511 -8.0638 -0.2855 -5.5850
hfenergy: -965.7946123 hartree
pointgroup: C01 [X(C13H11N3O4)]
dipole: -3.5701609 -0.9183158 0.0708183 debye
polarizability: 375.8291733|5.9226168|209.1028287|-5.6779617|15.4753717|90.8060438 unknown
InChI: InChI=1S/C13H11N3O4/c1-9-2-4-10(5-3-9)14-12-7-6-11(15(17)18)8-13(12)16(19)20/h2-8,14H,1H3
charge 0 multiplicity 1
31 atoms
O  2.595228 3.256559 -0.139957
O  0.341081 3.191613 0.17511
O  4.360117 -2.75154 0.089743
O  5.320458 -0.679019 -0.018616
N  -0.900792 0.894899 0.16167
N  1.505696 2.593236 0.029845
N  4.29161 -1.458542 0.049991
C  0.347888 0.320579 0.138959
C  -2.175122 0.256456 0.063223
C  1.550944 1.13195 0.068654
C  0.53839 -1.103529 0.214479
C  2.834641 0.546086 0.033293
C  2.953965 -0.846192 0.085896
C  -3.24002 0.776074 0.843072
C  -2.431352 -0.809637 -0.837509
C  -4.800764 -0.858013 -0.144252
C  1.804636 -1.678798 0.194244
C  -4.531323 0.222671 0.735934
C  -3.726723 -1.358559 -0.925605
C  -6.1992 -1.432961 -0.272781
H  -0.867937 1.930967 0.24371
H  -0.340433 -1.740875 0.330746
H  3.721157 1.182099 -0.031811
H  -3.047656 1.600192 1.539257
H  -1.637494 -1.181896 -1.492704
H  1.940275 -2.760779 0.270918
H  -5.341641 0.631634 1.350637
H  -3.910341 -2.180402 -1.627718
H  -6.175987 -2.498232 -0.561133
H  -6.761392 -1.346188 0.673392
H  -6.778808 -0.895753 -1.048588
