program: Gaussian 09
title: 000256355
version: EM64L-G09RevD.01
frameworkgroup: C1[X(C12H17NO3)]
method: RPBEPBE
basis: SDD
operation: Freq
keyword: #p
keyword: freq=noraman
keyword: PBEPBE/SDD
title: #p freq=noraman PBEPBE/SDD
converged: YES YES NO NO
title: Mulliken charges:
elementType: O O O N C C C C C C C C C C C C H H H H H H H H H H H H H H H H H
charge: -0.325372 -0.277081 -0.276010 -0.465071 0.047901 0.515610 -0.681015 -0.685195 0.399926 -0.614273 -0.391903 -0.391959 0.257556 -0.196031 -0.241290 -0.685428 0.233886 0.211028 0.254387 0.217368 0.208708 0.232544 0.221098 0.246677 0.330800 0.299913 0.245361 0.221741 0.208035 0.208067 0.206934 0.231555 0.231533
chargesum: 0.00000
title: Mulliken charges with hydrogens summed into heavy atoms:
elementType: O O O N C C C C C C C C C C C C
charge: -0.325372 -0.277081 -0.276010 -0.134270 0.281787 0.515610 0.001767 -0.022845 0.399926 -0.367596 -0.091990 -0.146598 0.257556 0.025710 0.174812 -0.015406
polarizability: 2.43378663e+02 1.68663510e-01 1.44736199e+02 -1.23094608e+00 -1.68288324e+00 8.81011960e+01
1716.lowfreq: -7.6246 -0.0009 -0.0008 -0.0007 1.5665 8.3586 32.0117 41.9555 60.4284
frequency: 31.8954 41.3374 60.4108 68.3866 80.0019 97.0165 116.4357 137.7030 194.6791 213.0441 221.1336 229.0121 245.6133 248.7567 256.3162 294.5153 333.8625 372.3364 394.4449 445.7978 452.8188 454.8802 583.5726 600.5077 602.3620 651.5961 689.3617 701.8709 704.9312 735.4315 778.2081 811.9277 827.5807 860.9724 867.9965 884.2806 898.9422 926.5594 938.0799 941.9126 977.5486 980.1964 1014.1566 1043.9356 1096.8773 1105.0606 1116.5671 1135.9343 1151.6516 1158.2052 1167.0362 1186.7285 1193.8284 1260.8129 1272.4644 1312.5530 1323.1697 1338.8916 1364.7033 1380.2302 1392.8214 1395.9807 1398.6740 1421.2658 1457.0994 1460.9305 1465.1189 1473.0786 1477.3638 1483.9993 1488.0219 1491.6973 1524.9902 1595.1285 1625.9944 1660.2604 2955.0093 2988.2608 2992.5696 2997.0729 3013.1536 3026.3450 3083.6932 3093.3880 3094.5964 3098.0398 3103.5604 3105.9258 3137.0403 3141.4305 3170.8472 3197.7551 3543.5176
redmass: 3.5127 3.2862 4.3717 3.9418 5.8922 2.7777 2.3948 3.6347 1.0281 2.7217 3.1241 2.4645 1.9061 1.4490 2.7908 4.8626 3.4641 3.3613 3.2145 4.2709 2.7780 2.8996 5.8846 3.0790 5.5158 1.6167 2.0034 4.8930 6.3980 4.9119 1.3853 3.7915 1.0972 3.8075 1.7123 1.3944 2.9413 1.2391 2.6803 1.5517 1.2994 5.8051 3.6063 2.7851 1.6147 1.8231 2.1783 1.4346 2.4083 1.9987 1.7817 1.8698 1.3737 1.1442 2.1452 1.6485 1.3867 1.3259 1.3921 1.2651 4.5138 1.2418 1.3548 2.7060 1.0538 1.0402 1.0485 1.0518 1.0956 1.9299 1.0496 1.2657 2.2490 5.3810 6.5807 8.5663 1.0554 1.0356 1.0358 1.0361 1.1075 1.0865 1.0994 1.0988 1.0989 1.1006 1.1006 1.1013 1.0883 1.0918 1.0941 1.0951 1.0760
irintensity: 0.4862 1.3246 0.1404 1.1800 7.0726 0.1173 4.0211 1.0005 0.0324 7.4002 1.6023 0.0890 2.2555 4.5490 1.1436 7.2145 0.1564 2.0481 8.6619 0.9725 1.6732 8.6218 4.3305 10.5278 5.2407 29.6067 29.9403 51.8494 8.7239 2.0843 47.6060 9.6007 0.4522 0.2720 56.8205 12.9041 1.9960 4.1600 168.0691 40.2190 3.0175 2.1191 229.3989 27.5042 69.4991 214.3503 2.6513 4.3833 112.6845 13.4525 421.2637 5.6698 66.4734 0.1195 130.4971 17.2529 8.3252 9.8693 8.9974 34.1822 127.1439 24.1681 96.0406 115.8088 5.9620 11.8241 4.9295 4.9364 28.7408 117.5613 24.4469 58.9999 290.2757 64.6920 352.3392 203.5269 41.6724 16.7078 27.0268 26.6681 36.8875 6.9519 6.8168 60.2773 29.6193 20.6988 32.5117 35.9795 17.7845 3.7415 11.8400 6.6097 27.5313
temp: 298.150 k
press: 1.00000 atm
elementType: 8 8 8 7 6 6 6 6 6 6 6 6 6 6 6 6 1 1 1 1 1 1 1 1 1 1 1 1 1 1 1 1 1
symmnumber: 1
zpe: 712565.6 jmol-1
zpe.correction: 0.271402 hartree
zpe.thermalcorrener: 0.288475 hartree
zpe.thermalcorrenthalpy: 0.289420 hartree
zpe.thermalcorrgfe: 0.225522 hartree
zpe.sumelectzpe: -746.696690 hartree
zpe.sumelectthermal: -746.679617 hartree
zpe.sumelectthermalent: -746.678673 hartree
zpe.sumelectthermalfe: -746.742570 hartree
dipole: -1.0266 -1.4786 0.2234
dipole: 1.8138
quadrupole: -66.2078 -95.3682 -98.4047
quadrupole: -7.9107 0.2838 0.1551
quadrupole: 20.4524 -8.7080 -11.7445 -7.9107 0.2838 0.1551
hfenergy: -746.9680921 hartree
pointgroup: C01 [X(C12H17N1O3)]
dipole: 0.4072198 0.5833496 0.0557527 debye
polarizability: 243.2731839|0.0136276|144.7856826|-4.2355778|-0.0556924|88.1571911 unknown
InChI: InChI=1S/C12H17NO3/c1-4-15-11-7-5-6-10(8-11)13-12(14)16-9(2)3/h5-9,13H,4H2,1-3H3
charge 0 multiplicity 1
33 atoms
O  -3.191429 0.810462 0.09026
O  3.774091 0.946392 0.028136
O  -2.50602 -1.449055 0.033325
N  -0.981037 0.371214 0.069874
C  -4.630579 0.375085 0.134364
C  0.289955 -0.265325 0.035167
C  -5.009913 0.040903 1.584182
C  -5.420576 1.541383 -0.463959
C  2.725256 0.012524 0.013622
C  1.428928 0.574115 0.046699
C  0.443781 -1.678652 -0.009544
C  2.898345 -1.393783 -0.030774
C  -2.233689 -0.222066 0.064362
C  1.746364 -2.213236 -0.041387
C  5.156101 0.428817 -0.007041
C  6.080425 1.643543 0.014447
H  -4.711968 -0.531067 -0.494664
H  -6.074372 -0.253017 1.637599
H  -4.402128 -0.798313 1.96183
H  -4.858469 0.919173 2.236768
H  -6.496015 1.28948 -0.495553
H  -5.081859 1.758913 -1.491224
H  -5.294438 2.452593 0.147068
H  1.335595 1.665513 0.080333
H  -0.993966 1.393078 0.096291
H  -0.436888 -2.322415 -0.019104
H  3.892619 -1.847089 -0.056667
H  1.869936 -3.301585 -0.075685
H  5.328784 -0.224407 0.872981
H  5.302308 -0.172301 -0.928022
H  7.136504 1.318509 -0.010382
H  5.892061 2.290539 -0.859125
H  5.918293 2.239073 0.928923
