program: Gaussian 09
title: 000256335
version: EM64L-G09RevD.01
frameworkgroup: C1[X(C9H12N6O2)]
method: RPBEPBE
basis: SDD
operation: Freq
keyword: #p
keyword: freq=noraman
keyword: PBEPBE/SDD
title: #p freq=noraman PBEPBE/SDD
converged: YES YES NO NO
title: Mulliken charges:
elementType: O O N N N N N N C C C C C C C C C H H H H H H H H H H H H
charge: -0.317418 -0.336214 -0.152024 -0.416458 -0.374900 0.053857 -0.029420 -0.406868 -0.332006 -0.354920 0.237574 0.104464 -0.232146 -0.111179 -0.212490 0.311813 -0.604754 0.258154 0.204495 0.272046 0.222004 0.248833 0.350501 0.336963 0.271268 0.294984 0.278025 0.217647 0.218168
chargesum: 0.00000
title: Mulliken charges with hydrogens summed into heavy atoms:
elementType: O O N N N N N N C C C C C C C C C
charge: -0.317418 -0.336214 -0.152024 -0.065957 -0.037936 0.053857 -0.029420 -0.111884 0.130643 0.139130 0.237574 0.104464 0.016686 -0.111179 0.058778 0.311813 0.109085
polarizability: 2.12283150e+02 -3.91177773e+00 1.54072169e+02 -1.34993617e+01 -2.66813435e+00 7.65790155e+01
1716.lowfreq: -9.2134 -4.6009 -0.0007 0.0006 0.0007 4.6691 16.5384 43.4413 58.6483
frequency: 16.0937 43.3854 58.6363 68.5816 98.2324 119.8676 147.7792 172.3838 173.7314 220.8434 232.5451 262.9509 312.5105 314.8654 340.3733 433.7546 447.7512 487.7184 490.4615 531.5658 566.7629 590.6333 614.6590 663.1903 674.2946 675.5791 690.8062 703.9469 718.4409 762.2468 776.1426 831.6437 871.9882 882.5915 888.6141 910.9394 951.3369 1007.9948 1042.8171 1063.0610 1076.4504 1102.1724 1126.9643 1132.3953 1150.1079 1186.2598 1206.7307 1239.2713 1246.2486 1257.8610 1309.5297 1327.5814 1338.2329 1346.9795 1354.0779 1383.4560 1388.1867 1420.1864 1448.2607 1458.8893 1471.0892 1474.3549 1477.5811 1488.1089 1488.9370 1525.4958 1535.2863 1630.5002 1650.0849 2960.9933 2966.4723 3022.4279 3039.2284 3048.3326 3090.0863 3104.3845 3157.3608 3244.0207 3436.2011 3562.1818 3581.7245
redmass: 5.7782 3.9035 4.7261 5.8906 2.2859 1.5231 3.1079 7.1632 7.3439 3.0785 4.4633 3.9660 7.7322 5.1465 2.9473 1.8586 1.7441 3.5611 3.8231 7.3494 3.8453 5.3396 4.1148 2.4678 2.7350 2.4534 2.8223 2.5675 2.4748 5.4717 8.0668 1.5051 2.4693 3.0802 1.5562 5.5657 4.7270 3.0159 2.7916 1.9443 3.6169 3.7139 1.2736 1.5462 2.2737 3.6273 2.8107 1.2039 2.3281 2.1125 1.9006 1.7557 2.4354 1.6692 1.3242 2.1278 2.8177 1.1754 1.3290 1.3669 1.4242 2.9668 1.9336 1.0793 1.6034 2.6887 2.7448 4.7511 8.7539 1.0667 1.0365 1.0606 1.1026 1.0933 1.1051 1.0966 1.0925 1.0994 1.0795 1.0773 1.0826
irintensity: 2.7302 3.0588 3.5489 0.8352 13.0870 4.5715 1.4687 3.4540 12.8531 2.4884 4.1298 5.3270 38.5178 10.6616 15.5735 28.6389 35.5576 0.4037 2.3625 0.2499 0.0809 1.6536 18.2871 58.9047 64.2129 19.8524 7.1133 163.7683 33.1139 13.2259 2.8610 17.6535 11.3219 9.2073 12.4285 1.5353 9.1583 18.1648 0.5754 33.2769 30.5692 66.4751 0.1579 41.8680 36.2278 29.7711 65.8828 29.3893 5.3794 125.4903 45.0501 68.1109 68.1760 5.6772 0.5111 54.9654 45.9992 31.5541 11.2907 18.7695 82.4795 184.1610 9.0182 31.0305 247.2234 286.6281 332.4804 155.1693 343.8251 79.5232 92.6139 17.0418 49.9538 10.4901 9.8480 1.9284 4.7052 1.1845 328.5200 11.5099 72.7318
temp: 298.150 k
press: 1.00000 atm
elementType: 8 8 7 7 7 7 7 7 6 6 6 6 6 6 6 6 6 1 1 1 1 1 1 1 1 1 1 1 1
symmnumber: 1
zpe: 588062.8 jmol-1
zpe.correction: 0.223981 hartree
zpe.thermalcorrener: 0.239504 hartree
zpe.thermalcorrenthalpy: 0.240448 hartree
zpe.thermalcorrgfe: 0.179079 hartree
zpe.sumelectzpe: -827.894032 hartree
zpe.sumelectthermal: -827.878509 hartree
zpe.sumelectthermalent: -827.877565 hartree
zpe.sumelectthermalfe: -827.938934 hartree
dipole: 0.8365 -4.5800 1.4537
dipole: 4.8774
quadrupole: -128.1983 -82.9479 -101.1307
quadrupole: -4.8586 -0.7035 3.7512
quadrupole: -24.1060 21.1444 2.9616 -4.8586 -0.7035 3.7512
hfenergy: -828.1180131 hartree
pointgroup: C01 [X(C9H12N6O2)]
dipole: -0.4170076 -1.8254011 -0.4198819 debye
polarizability: 213.4005973|-0.60556|153.7798246|-7.7121597|-3.8489641|75.7539119 unknown
InChI: InChI=1S/C9H12N6O2/c1-10-9(17)11-2-3-15-5-14-7-6(8(15)16)12-4-13-7/h4-5,10-12H,2-3H2,1H3
charge 0 multiplicity 1
29 atoms
O  -0.125676 -1.20946 -0.376833
O  4.465251 0.885595 0.568944
N  -0.748905 1.090358 -0.419018
N  2.30584 -0.013061 0.398151
N  -3.150733 -1.706413 0.107283
N  -3.03791 1.858706 -0.06399
N  -4.663472 -0.00078 0.284778
N  4.171611 -1.433889 0.378705
C  0.654864 1.514269 -0.717618
C  1.663033 1.296823 0.441883
C  -1.031829 -0.3121 -0.292759
C  -2.433183 -0.527503 -0.064613
C  -1.748179 2.070346 -0.293286
C  -3.384583 0.521385 0.048907
C  -4.480669 -1.337034 0.311288
C  3.695215 -0.123987 0.456416
C  5.604922 -1.727851 0.420176
H  1.00349 0.965664 -1.610342
H  0.604028 2.588238 -0.966705
H  2.476161 2.042076 0.366654
H  1.145064 1.472543 1.407847
H  -1.400241 3.102372 -0.401157
H  1.688089 -0.808836 0.194027
H  -2.759556 -2.648351 0.084034
H  -5.271958 -2.065476 0.472331
H  3.508407 -2.20665 0.318138
H  6.132305 -0.763224 0.496314
H  5.943053 -2.246023 -0.497595
H  5.87116 -2.346634 1.298739
