program: Gaussian 09
title: 000264451
version: EM64L-G09RevD.01
frameworkgroup: C1[X(C16H15Cl3O)]
method: RPBEPBE
basis: SDD
operation: Freq
keyword: #p
keyword: freq=noraman
keyword: PBEPBE/SDD
title: #p freq=noraman PBEPBE/SDD
converged: YES YES NO NO
title: Mulliken charges:
elementType: Cl Cl Cl O C C C C C C C C C C C C C C C C H H H H H H H H H H H H H H H
charge: 0.112519 0.123917 0.062589 -0.416951 0.311516 -0.721496 0.290125 -0.186447 0.533293 -0.347073 -0.314708 -0.550898 -0.610989 -0.485606 -0.243687 -0.258231 0.442979 -0.213853 -0.385052 -0.814305 0.237693 0.215106 0.263149 0.246745 0.273878 0.245398 0.235287 0.229577 0.230026 0.223780 0.231461 0.352289 0.228864 0.232785 0.226318
chargesum: 0.00000
title: Mulliken charges with hydrogens summed into heavy atoms:
elementType: Cl Cl Cl O C C C C C C C C C C C C C C C C
charge: 0.112519 0.123917 0.062589 -0.064662 0.311516 -0.268697 0.290125 0.076702 0.533293 -0.100328 -0.040831 -0.305499 -0.610989 -0.250320 -0.014109 -0.028204 0.442979 0.009928 -0.153591 -0.126338
polarizability: 2.42240710e+02 -8.44969790e+00 1.91368354e+02 -2.01837654e+01 6.12999265e+00 1.76255876e+02
1716.lowfreq: -7.4464 -1.2491 0.0011 0.0014 0.0020 6.1207 11.4688 21.3418 26.0413
frequency: 9.4322 21.2315 25.8898 35.3212 42.7503 73.7852 78.7052 146.6176 157.6861 171.1965 188.1685 203.0295 218.3044 236.5601 252.6954 265.7563 283.7775 294.2836 333.9937 364.9070 380.1882 406.2457 420.2190 434.1692 467.4165 499.8942 516.5493 525.4970 557.5600 581.3876 605.6438 623.6020 681.9513 705.1003 715.6046 750.3301 755.8119 773.4997 788.5030 816.5572 835.9571 886.1268 896.9066 901.2700 926.4852 939.9946 965.5458 977.1852 981.4800 989.2516 998.3614 1000.0159 1004.2269 1047.9183 1050.1141 1081.0077 1098.2912 1163.1949 1170.2018 1177.4247 1181.4251 1184.7873 1194.1197 1236.6309 1260.3569 1284.2272 1291.5302 1308.6747 1324.8771 1355.1668 1379.1078 1389.7701 1397.8544 1429.4091 1436.8863 1463.5018 1471.1280 1473.7066 1484.8315 1486.5154 1585.6042 1598.3381 1612.7709 1618.6012 2976.3947 2991.1840 2993.0893 3033.8581 3055.7110 3085.5324 3112.7882 3115.7407 3123.0155 3124.3187 3138.9143 3150.4391 3156.6415 3178.5090 3513.6338
redmass: 5.2188 1.8588 1.5029 7.8676 7.4685 7.0625 5.8484 4.8271 9.6963 9.6293 7.7923 3.3593 3.6318 6.7677 11.4282 12.1481 4.0638 4.0185 6.3994 6.5873 2.4422 1.7671 2.0000 2.8721 3.3959 4.1715 4.9668 4.2239 5.0222 4.9853 7.5060 4.8897 5.5228 2.5630 3.5122 4.1635 5.0842 1.3426 1.8949 2.9982 3.7530 1.4287 1.6437 1.3237 2.3186 1.8929 3.0283 1.8604 1.3472 5.4059 1.5064 4.8091 1.6218 1.5964 2.2274 2.4445 1.6989 1.6294 1.6044 1.0905 1.1290 1.1472 1.5119 1.7975 2.2834 1.5847 1.2899 1.2826 1.4333 1.9592 6.5028 3.3181 1.2431 2.2213 2.2219 1.1022 1.2200 1.4077 2.4535 1.5283 6.6558 6.0118 6.1013 6.1109 1.0378 1.0633 1.0797 1.0980 1.0965 1.0992 1.0877 1.0896 1.0918 1.0861 1.0906 1.0991 1.0966 1.0964 1.0652
irintensity: 0.0358 0.1819 0.3274 0.0514 0.0581 0.1183 0.4957 0.2154 0.3820 0.6846 0.8030 3.0765 0.2447 2.2224 3.1632 1.4287 13.1246 1.9891 3.5458 7.1832 0.9662 72.6368 76.4704 9.7319 6.2563 15.4755 8.9961 4.7014 25.1350 59.3035 88.0671 8.1497 66.8938 31.4174 12.7050 16.8889 116.6928 67.3865 8.0234 26.6667 12.8834 1.0917 2.1930 0.5068 1.3774 2.5301 8.7619 14.5146 0.3613 1.6029 9.7531 42.7524 4.2672 8.5746 13.3352 4.9726 11.3487 2.9082 57.5202 1.4862 0.0412 0.1991 4.3995 13.5005 3.2480 1.1166 28.7615 0.8039 0.5903 22.8562 0.4893 9.8380 13.0297 2.5350 6.6701 10.0422 8.8409 14.7335 14.5596 27.2246 6.9111 6.6576 7.9095 22.8331 33.2282 20.6552 17.7296 12.6879 20.1399 16.7325 4.0437 11.0702 27.4752 1.9695 14.0279 31.5162 25.4257 7.9311 11.4756
temp: 298.150 k
press: 1.00000 atm
elementType: 17 17 17 8 6 6 6 6 6 6 6 6 6 6 6 6 6 6 6 6 1 1 1 1 1 1 1 1 1 1 1 1 1 1 1
symmnumber: 1
zpe: 692041.9 jmol-1
zpe.correction: 0.263585 hartree
zpe.thermalcorrener: 0.283498 hartree
zpe.thermalcorrenthalpy: 0.284443 hartree
zpe.thermalcorrgfe: 0.210884 hartree
zpe.sumelectzpe: -2072.647381 hartree
zpe.sumelectthermal: -2072.627467 hartree
zpe.sumelectthermalent: -2072.626523 hartree
zpe.sumelectthermalfe: -2072.700081 hartree
dipole: 1.9175 -0.0982 0.4407
dipole: 1.9700
quadrupole: -134.6304 -134.6798 -133.4226
quadrupole: -1.1734 -3.4019 -2.1030
quadrupole: -0.3861 -0.4356 0.8217 -1.1734 -3.4019 -2.1030
hfenergy: -2072.9109654 hartree
pointgroup: C01 [X(C16H15Cl3O1)]
dipole: -0.7492623 0.0578808 0.189581 debye
polarizability: 244.3897597|9.6834298|182.1298073|16.8995701|-8.0431282|183.345374 unknown
InChI: InChI=1S/C16H15Cl3O/c1-11-5-4-6-12(9-11)10-13-7-2-3-8-14(13)15(20)16(17,18)19/h2-9,15,20H,10H2,1H3
charge 0 multiplicity 1
35 atoms
Cl 2.719272 0.510582 -2.507627
Cl 4.796152 0.058515 -0.35386
Cl 3.862483 2.870483 -0.985635
O  2.663478 1.455453 1.515867
C  0.328873 -0.778579 -0.211219
C  -0.480052 0.099949 -1.169821
C  1.537451 -0.376484 0.429853
C  2.153474 1.002674 0.228481
C  -1.968853 0.195949 -0.833551
C  -0.161703 -2.087195 0.045946
C  2.195999 -1.265596 1.32099
C  -2.393948 0.540898 0.475791
C  3.311972 1.051523 -0.831408
C  -2.94794 -0.020449 -1.83236
C  0.509188 -2.975408 0.907592
C  1.693485 -2.558032 1.559025
C  -3.764017 0.680797 0.801383
C  -4.322132 0.111286 -1.524364
C  -4.727857 0.459208 -0.218942
C  -4.200489 1.070143 2.203984
H  -0.369976 -0.298017 -2.197202
H  -0.064193 1.123478 -1.21414
H  1.402083 1.714708 -0.168693
H  -1.096492 -2.396751 -0.435577
H  3.091864 -0.917253 1.841314
H  -1.639534 0.691472 1.258974
H  -2.637663 -0.292476 -2.848925
H  0.107538 -3.980205 1.079954
H  2.21489 -3.230835 2.248249
H  -5.074545 -0.062246 -2.302257
H  -5.795432 0.55633 0.014894
H  3.048271 2.366422 1.411652
H  -3.370926 0.981125 2.92624
H  -4.558461 2.117385 2.234081
H  -5.031054 0.433145 2.559413
