program: Gaussian 09
title: 000256313
version: EM64L-G09RevD.01
frameworkgroup: C1[X(C16H19NO2)]
method: RPBEPBE
basis: SDD
operation: Freq
keyword: #p
keyword: freq=noraman
keyword: PBEPBE/SDD
title: #p freq=noraman PBEPBE/SDD
converged: YES YES NO NO
title: Mulliken charges:
elementType: O O N C C C C C C C C C C C C C C C C H H H H H H H H H H H H H H H H H H H
charge: -0.307986 -0.291241 -0.173593 0.360845 0.417709 0.134030 0.100157 -0.520946 -0.489195 -0.433431 0.408599 -0.651606 -0.661339 -0.427894 -0.387809 -0.281709 -0.291118 -0.523694 -0.525305 0.264209 0.264065 0.264246 0.222938 0.229863 0.243002 0.301572 0.215543 0.222704 0.240648 0.229057 0.232443 0.231069 0.234319 0.232639 0.224717 0.239789 0.234873 0.217831
chargesum: 0.00000
title: Mulliken charges with hydrogens summed into heavy atoms:
elementType: O O N C C C C C C C C C C C C C C C C
charge: -0.307986 -0.291241 -0.173593 0.360845 0.417709 0.134030 0.100157 -0.256737 -0.225130 -0.169186 0.408599 0.044197 0.078480 -0.187247 -0.158753 -0.049266 -0.060049 0.167982 0.167188
polarizability: 4.06633501e+02 2.54086164e+01 2.00506513e+02 -1.12366295e+00 -9.30735783e+00 1.05257586e+02
1716.lowfreq: -6.5080 -4.7343 -0.0005 -0.0003 0.0006 6.8971 32.1953 43.9316 58.6468
frequency: 32.1418 43.8996 58.6454 65.8956 83.5814 90.5828 104.5088 125.5817 154.1488 158.5736 167.7527 181.4110 208.9504 218.7615 237.3216 250.6214 260.4248 276.6442 305.6970 326.7366 359.4233 378.9915 433.8119 438.6473 494.2906 503.9717 544.9965 566.0031 577.1551 635.2616 657.6694 702.3382 709.4065 723.4043 736.1898 756.8299 770.9623 801.5050 802.2896 862.3962 893.8734 896.4419 906.5301 911.0847 917.1466 943.1544 955.2261 966.1218 1013.2625 1055.1199 1078.7166 1083.8307 1091.8734 1097.4117 1112.9500 1114.9553 1121.1273 1136.1264 1151.3657 1153.8880 1163.4934 1172.3341 1206.7224 1235.6464 1254.0218 1285.5160 1334.9496 1351.3368 1357.9628 1392.2534 1407.7111 1425.1224 1433.5741 1435.8514 1456.6902 1457.4923 1458.7097 1463.8169 1470.7383 1473.3205 1473.8785 1478.5560 1489.4901 1499.9958 1514.7524 1529.0502 1540.1937 1610.3872 1629.1122 2922.9783 2937.2296 2957.9795 2963.8767 3031.9311 3038.5203 3047.4875 3055.0182 3090.0891 3092.7210 3113.9882 3115.5643 3116.8592 3163.4330 3172.7448 3173.2599 3181.0052 3195.7892 3212.4482
redmass: 3.9684 3.2592 3.4717 3.4534 3.4534 3.2584 2.4610 3.0754 1.1126 1.0897 2.3915 3.0483 1.5817 3.6030 2.1907 4.7584 1.4840 4.4036 4.2587 4.5902 3.4495 3.4833 3.0885 6.5271 2.8889 4.8349 4.4899 3.6631 4.4906 2.0328 4.7053 4.1176 2.7695 2.2661 2.7569 4.2885 1.7258 5.3738 5.6333 1.6713 1.6635 2.1309 1.5994 1.3895 3.1558 4.1661 1.4980 4.4149 2.7446 1.5241 1.1991 1.6295 1.2376 1.7384 1.2536 1.2734 2.1844 1.4276 1.4107 1.5455 1.8116 2.4177 3.1039 2.2781 1.7192 1.5750 2.2877 3.0736 3.8654 2.0324 3.1070 1.1355 1.2095 1.1971 1.3714 1.0903 1.0780 2.4421 1.1694 1.0680 1.1108 1.1783 1.4074 1.1094 2.2870 4.6097 4.8577 7.2261 7.7496 1.0487 1.0462 1.0316 1.0307 1.0899 1.0826 1.1040 1.1046 1.1014 1.0874 1.0993 1.1012 1.1009 1.0869 1.0904 1.0916 1.0919 1.1021 1.1064
irintensity: 1.5174 2.9886 0.3044 0.5928 0.6348 5.5595 5.4800 0.5854 0.5164 0.2320 5.0051 5.2358 1.1366 1.3969 1.4375 4.8933 7.0358 3.6209 22.6523 5.6521 8.1375 5.8457 1.0037 10.1362 8.9778 0.6126 28.2827 5.8488 7.5962 49.0022 10.6356 6.2971 1.9161 0.8101 8.0391 6.5487 87.4196 12.8927 1.7449 19.8645 16.1484 17.8586 12.9503 0.1068 70.2925 52.9456 23.5730 77.2654 44.0001 19.9136 23.2461 36.2494 12.7556 65.8725 7.3408 16.4363 76.0614 97.2011 13.6169 1.9908 74.4917 22.3127 52.4333 20.3831 80.2594 7.5659 24.2592 31.1874 272.4249 58.5956 5.9098 4.2730 7.5940 24.7794 29.0700 18.7851 27.5043 81.1576 11.7768 4.0042 43.9619 72.5120 55.1978 9.5489 129.6573 82.4576 15.6082 574.7705 23.6017 100.8974 219.6292 58.3029 62.9969 51.0746 33.0815 33.8757 29.4507 25.8073 8.3885 5.8111 26.8869 26.5435 1.3324 10.6413 7.7368 1.5144 31.4399 22.4877
temp: 298.150 k
press: 1.00000 atm
elementType: 8 8 7 6 6 6 6 6 6 6 6 6 6 6 6 6 6 6 6 1 1 1 1 1 1 1 1 1 1 1 1 1 1 1 1 1 1 1
symmnumber: 1
zpe: 813420.2 jmol-1
zpe.correction: 0.309815 hartree
zpe.thermalcorrener: 0.329429 hartree
zpe.thermalcorrenthalpy: 0.330373 hartree
zpe.thermalcorrgfe: 0.261339 hartree
zpe.sumelectzpe: -824.807815 hartree
zpe.sumelectthermal: -824.788201 hartree
zpe.sumelectthermalent: -824.787257 hartree
zpe.sumelectthermalfe: -824.856291 hartree
dipole: 5.2990 0.9160 2.6572
dipole: 5.9982
quadrupole: -99.7404 -106.0839 -115.2892
quadrupole: -3.0618 0.8877 -0.4103
quadrupole: 7.2974 0.9539 -8.2513 -3.0618 0.8877 -0.4103
hfenergy: -825.11763 hartree
pointgroup: C01 [X(C16H19N1O2)]
dipole: 1.9282391 -0.398406 -1.3008535 debye
polarizability: 400.0150448|-33.6150358|203.3247019|-35.9772436|-1.5080957|109.0578528 unknown
InChI: InChI=1S/C16H19NO2/c1-17(2)14-11-15(18-3)13(10-16(14)19-4)9-12-7-5-6-8-12/h5-11H,1-4H3
charge 0 multiplicity 1
38 atoms
O  2.063557 2.260239 0.076461
O  -0.195182 -2.915212 0.187006
N  3.772793 -0.115094 -0.283943
C  2.383316 -0.218466 -0.081328
C  -0.486327 -0.465309 0.390152
C  1.537756 0.936454 0.104615
C  0.347035 -1.603386 0.141321
C  1.727795 -1.485912 -0.083116
C  0.167259 0.803217 0.352432
C  -1.89257 -0.663143 0.716858
C  -2.959218 0.22249 0.672356
C  4.51294 -1.305631 -0.730307
C  4.584188 0.824181 0.524693
C  -4.313925 -0.1383 1.150996
C  -3.052744 1.608897 0.168782
C  -5.146527 0.950075 0.964079
C  -4.360218 2.035836 0.340649
C  2.393019 2.731884 -1.286207
C  -0.915077 -3.32353 -1.036337
H  2.293715 -2.411867 -0.210818
H  -0.391675 1.71904 0.558118
H  -2.123742 -1.684374 1.055314
H  4.648638 -2.061262 0.075718
H  5.514589 -0.990174 -1.070328
H  3.997932 -1.787323 -1.578911
H  3.982951 1.702928 0.797545
H  5.46446 1.154064 -0.057092
H  4.945226 0.335972 1.455776
H  -4.570584 -1.103332 1.594218
H  -2.252756 2.173146 -0.310516
H  -6.206151 1.012959 1.221852
H  -4.762854 3.009507 0.049657
H  3.16112 2.087294 -1.754581
H  2.778002 3.755759 -1.162072
H  1.483651 2.74458 -1.916725
H  -1.756998 -2.638663 -1.253814
H  -1.29652 -4.335863 -0.833104
H  -0.225676 -3.345876 -1.903097
