program: Gaussian 09
title: 000256309
version: EM64L-G09RevD.01
frameworkgroup: C1[X(C8H8I2O3S)]
method: RPBEPBE
basis: SDD
operation: Freq
keyword: #p
keyword: freq=noraman
keyword: PBEPBE/SDD
title: #p freq=noraman PBEPBE/SDD
converged: NO YES NO NO
title: Mulliken charges:
elementType: I I S O O O C C C C C C C C H H H H H H H H
charge: 0.069562 0.055940 0.954768 -0.569955 -0.495949 -0.474466 -0.222696 0.571947 0.550271 -0.373762 -0.283690 -0.350014 -0.924452 -0.940728 0.302202 0.257150 0.249217 0.327991 0.304804 0.300706 0.306680 0.384475
chargesum: 0.00000
title: Mulliken charges with hydrogens summed into heavy atoms:
elementType: I I S O O O C C C C C C C C
charge: 0.069562 0.055940 0.954768 -0.185480 -0.495949 -0.474466 -0.222696 0.571947 0.550271 -0.071561 -0.026540 -0.100797 -0.291657 -0.333342
polarizability: 2.37602884e+02 8.90581970e-01 1.61250725e+02 -1.05410033e+00 6.16542385e+00 1.31810607e+02
1716.lowfreq: -5.3214 -0.0006 0.0011 0.0013 4.9772 5.8218 23.7414 29.2580 31.8522
frequency: 23.6977 29.0028 31.8210 41.1246 88.7520 106.5745 127.2265 148.8760 189.2159 220.0371 230.6195 257.8631 290.7191 310.5554 324.7060 329.2598 407.0739 420.2229 440.8206 466.3425 492.7191 525.1123 551.8135 631.5368 661.4635 732.3387 764.8039 825.8992 833.7419 840.9372 855.1956 866.5185 927.4348 965.7917 980.7824 1013.8480 1045.3948 1077.9214 1108.9070 1166.9048 1177.9829 1179.3244 1220.2189 1237.1546 1286.6315 1371.6869 1410.6365 1457.7266 1462.9902 1488.1707 1550.9354 1613.5277 3073.2627 3082.2087 3136.2489 3142.5288 3156.7884 3158.0688 3171.9202 3482.3350
redmass: 18.0064 11.5086 12.7269 10.2920 7.7119 5.4983 9.5558 6.6243 2.4869 5.1197 4.2434 2.7082 2.9375 3.4423 5.1180 7.7063 5.0615 4.4740 4.1756 4.7992 6.4490 6.6012 8.7808 3.6370 7.0407 3.8435 4.5503 1.7195 4.7774 1.5752 1.5200 4.1321 1.4385 13.6102 1.3968 2.9122 1.2016 1.3136 1.0988 1.1725 1.2147 1.1841 1.6445 5.4197 1.3970 3.6741 4.0445 1.1248 1.1179 3.0984 6.6386 6.9753 1.0575 1.0585 1.0881 1.0925 1.0999 1.1082 1.1093 1.0662
irintensity: 0.1614 0.3731 0.3161 0.0827 2.5993 0.7957 0.2201 3.4459 17.8051 16.2976 7.5761 21.9605 30.7162 61.5876 10.8556 10.5494 27.8306 0.1447 56.0252 0.7949 26.6254 58.6023 130.0254 14.7675 3.8375 4.1711 27.5955 3.3595 48.2127 14.0940 19.3853 6.0986 14.2670 92.0758 0.1806 6.7292 69.6330 9.9869 1.0233 4.1180 37.7677 31.4861 29.1379 3.8590 0.1185 9.6248 9.4165 6.1097 9.0190 14.0360 1.8722 1.1855 7.7260 3.6421 5.1570 7.8917 6.6135 2.8033 1.7860 48.2111
temp: 298.150 k
press: 1.00000 atm
elementType: 53 53 16 8 8 8 6 6 6 6 6 6 6 6 1 1 1 1 1 1 1 1
symmnumber: 1
zpe: 378103.2 jmol-1
zpe.correction: 0.144012 hartree
zpe.thermalcorrener: 0.159780 hartree
zpe.thermalcorrenthalpy: 0.160724 hartree
zpe.thermalcorrgfe: 0.095607 hartree
zpe.sumelectzpe: -955.179334 hartree
zpe.sumelectthermal: -955.163566 hartree
zpe.sumelectthermalent: -955.162622 hartree
zpe.sumelectthermalfe: -955.227739 hartree
dipole: 1.0306 -0.7031 5.2333
dipole: 5.3800
quadrupole: -122.4254 -118.4626 -118.8392
quadrupole: -2.9752 -1.6352 3.3508
quadrupole: -2.5163 1.4465 1.0698 -2.9752 -1.6352 3.3508
hfenergy: -955.3233455 hartree
pointgroup: C01 [X(C8H8I2O3S1)]
dipole: -0.8502775 0.8095074 1.7612229 debye
dipolederiv: -0.2555303 -0.1454764 0.0447806 -0.2480145 -0.249064 0.1270265 0.2854448 0.2325052 -0.2077484 -0.4580063 -0.1122552 -0.1445294 -0.0536761 -0.0786009 -0.0026874 -0.5008937 -0.1253186 -0.3255266 1.5781726 -0.3111791 0.1558372 -0.3100646 1.5702013 -0.1342006 0.1367146 -0.0175081 1.4734238 -0.6168997 -0.0217945 -0.2760908 -0.0065975 -0.5274882 0.1565632 -0.3071484 0.1713485 -0.922045 -0.5814079 0.0287381 -0.0491594 0.0486552 -0.7154384 -0.0367807 0.0085015 -0.0190742 -0.439412 -0.6460746 0.0650319 0.0897196 0.0803033 -0.5717955 0.074776 0.048404 -0.023898 -0.4813942 0.0277415 -0.1112498 0.0104899 -0.1125188 -0.0345902 -0.0389794 0.1605775 -0.0155234 -0.118325 -0.0911921 0.3292022 -0.1034258 -0.0740602 0.0082426 0.0293518 -0.1507988 -0.0383182 -0.0631037 0.0800143 0.1076708 0.0294341 -0.1296408 -0.0851429 0.0555147 0.0958629 0.0687242 -0.1024292 -0.2471721 -0.1593217 0.0320545 0.2384632 -0.1641086 -0.0093959 -0.0127099 -0.0058623 -0.0674183 -0.2344785 -0.0929461 0.0258704 0.1331332 0.0788159 0.0637812 0.0167918 0.005608 -0.0732419 0.0706553 -0.0947538 -0.0741477 -0.0366797 0.0458955 0.0349837 -0.0192791 -0.0065855 -0.0945455 0.2807106 0.2220733 -0.135976 0.2282131 0.2726053 -0.236822 -0.2695798 -0.3140182 0.3994424 0.6040563 0.1442603 0.3130263 0.1574192 0.0454631 0.0274796 0.5361505 0.0733457 0.5512237 0.1572325 -0.0238993 0.0235434 -0.0591727 0.0747675 -0.0259933 -0.0215037 -0.020159 0.1321887 0.0569706 -0.0156718 -0.0227048 -0.0256366 -0.0583988 -0.0300896 0.0160164 -0.0190043 0.131976 -0.0319891 0.0786757 0.0338307 0.0776915 0.0536807 -0.0068826 0.0085874 -0.0159173 0.1280288 0.0388173 -0.0414042 0.04064 0.054139 0.0548375 0.0611098 0.0316221 0.1160728 -0.0076438 0.0501567 -0.0051605 0.0535664 -0.0616958 -0.0002103 0.0103478 0.0493841 -0.0032824 -0.0741654 -0.0245108 -0.007021 -0.0333884 0.0529981 0.0543009 -0.060223 -0.0211118 -0.0601323 -0.0787646 0.0298523 0.0365583 -0.0725086 -0.0400151 -0.0120432 0.0387123 -0.0931221 0.0499355 -0.032683 0.2128813 0.1299229 0.0591377 0.0867564 0.2380707 -0.097592 0.0020899 -0.032938 0.2721632 unknown
polarizability: 226.7274432|27.5767256|162.8210423|12.4388033|-11.1964804|141.1157309 unknown
InChI: InChI=1S/C8H8I2O3S/c9-4-6-1-2-7(5-10)8(3-6)14(11,12)13/h1-3,11H,4-5H2
charge 0 multiplicity 1
22 atoms
I  2.391095 2.849134 -1.382519
I  -4.446863 -0.51844 -1.690864
S  1.660581 -1.504103 -0.009237
O  2.258291 -1.387616 1.755126
O  1.02625 -2.967637 -0.271059
O  2.847752 -0.961009 -0.962076
C  0.261588 -0.253854 0.223282
C  0.53154 1.119844 0.429669
C  -2.144834 0.023278 0.370124
C  -1.019687 -0.81952 0.189336
C  -0.618383 1.939302 0.615674
C  -1.919766 1.4096 0.586582
C  1.902122 1.724724 0.493512
C  -3.528798 -0.544491 0.365231
H  -1.136503 -1.896419 0.022199
H  -0.468662 3.013293 0.772544
H  -2.778078 2.076499 0.725834
H  2.719691 0.999733 0.583474
H  1.972744 2.497723 1.270686
H  -4.241643 0.042335 0.960908
H  -3.568734 -1.606721 0.641919
H  3.028795 -2.019654 1.854855
