program: Gaussian 09
title: 000256304
version: EM64L-G09RevD.01
frameworkgroup: C1[X(C20H28O9S)]
method: RPBEPBE
basis: SDD
operation: Freq
keyword: #p
keyword: freq=noraman
keyword: PBEPBE/SDD
title: #p freq=noraman PBEPBE/SDD
converged: NO YES NO NO
title: Mulliken charges:
elementType: S O O O O O O O O O C C C C C C C C C C C C C C C C C C C C H H H H H H H H H H H H H H H H H H H H H H H H H H H H
charge: 1.055141 -0.300472 -0.326471 -0.260315 -0.258266 -0.428957 -0.315222 -0.506260 -0.511439 -0.244622 -0.117977 -0.047849 -0.099765 -0.124807 -0.374382 -0.369104 0.364747 0.361687 -0.673710 -0.699605 -0.713563 -0.671765 0.250714 -0.751222 0.242858 -0.356832 -0.332809 -0.222736 -0.223393 -0.223609 0.298316 0.292013 0.237203 0.246105 0.233006 0.237520 0.235585 0.225397 0.221509 0.238696 0.224870 0.221840 0.221040 0.240503 0.243622 0.233871 0.208542 0.240662 0.221094 0.226273 0.284841 0.274345 0.343946 0.271056 0.259489 0.234230 0.231242 0.233190
chargesum: 0.00000
title: Mulliken charges with hydrogens summed into heavy atoms:
elementType: S O O O O O O O O O C C C C C C C C C C C C C C C C C C C C
charge: 1.055141 -0.300472 -0.326471 -0.260315 -0.258266 -0.428957 -0.315222 -0.506260 -0.511439 -0.244622 0.180339 0.244164 0.137438 0.121297 0.096144 0.091878 0.364747 0.361687 0.011364 -0.016222 -0.027528 0.016265 0.250714 0.151910 0.242858 -0.085776 -0.073320 0.011494 0.007849 0.009581
polarizability: 3.59434133e+02 -2.02202825e+01 2.38545644e+02 -2.27965149e+00 9.65065396e+00 2.25382028e+02
1716.lowfreq: -10.5293 -6.3359 -0.0022 -0.0021 -0.0008 4.0244 9.5684 21.1034 22.9454
frequency: 1.2709 20.6550 22.7185 26.4953 34.4949 38.7077 43.4907 57.6347 59.8316 74.4191 83.7302 89.5486 100.8306 121.1059 141.6571 156.6471 160.0335 170.4910 174.8906 180.1184 192.2086 205.7654 208.2632 212.2540 216.7689 226.4216 243.3126 267.9322 274.1541 283.9661 310.1388 314.3145 331.6705 335.2781 341.7124 350.3257 369.5720 382.1358 402.5457 403.6283 414.1306 419.0239 433.1335 454.0380 483.4211 487.0049 524.1577 573.2164 577.4069 600.1870 614.1028 619.8843 622.9527 654.3141 673.3467 675.7134 700.1840 716.4025 735.5072 738.9068 748.0800 752.7017 794.6541 795.8664 831.7303 841.2458 863.7145 891.6840 913.9253 916.0369 918.1711 924.2454 926.0847 934.7305 943.1954 953.2305 964.5584 982.6704 983.6235 987.2323 989.2952 990.8065 994.9329 995.7692 1003.0029 1007.5251 1008.6797 1017.7255 1045.1578 1048.3010 1053.1299 1058.0876 1086.4249 1107.2718 1136.3255 1137.5293 1149.6640 1174.0496 1179.8699 1182.4837 1188.1579 1202.3117 1203.2999 1237.0947 1252.7107 1262.0078 1263.6507 1270.5539 1271.5619 1273.8080 1308.4948 1311.2330 1315.6764 1320.6805 1328.8972 1332.5223 1352.3284 1369.8157 1380.1136 1383.0044 1389.7360 1391.6889 1395.3756 1409.5252 1437.1171 1438.1660 1449.9154 1452.4082 1454.0225 1455.8284 1467.6992 1470.2753 1472.9559 1476.5979 1478.0036 1484.8549 1485.2691 1586.3032 1611.4424 1628.1634 2995.9022 2998.8905 3000.6817 3004.8874 3007.5105 3012.3643 3013.9463 3014.6848 3033.0111 3035.6288 3051.5835 3096.0696 3099.5690 3101.4413 3101.5944 3107.4644 3110.2483 3115.3105 3116.1359 3119.0176 3121.3979 3130.4013 3142.9552 3155.2380 3165.7929 3167.2961 3181.9241 3185.0454
redmass: 5.5364 5.0279 5.5157 5.0528 4.2800 3.8517 4.0323 4.7041 5.1554 5.3861 6.5073 6.1586 6.8506 4.6872 1.0447 5.1984 6.8837 1.2683 2.1886 3.0375 2.8767 1.3835 1.4740 2.4593 2.0367 1.1129 3.2813 4.8864 4.7763 6.2611 4.6942 5.5689 3.3936 3.1358 5.2910 3.5951 4.8392 3.5522 2.8456 2.9318 4.2372 3.1834 4.1990 4.8426 3.8248 4.0236 6.2190 7.9806 6.0354 7.8619 6.4344 4.5479 5.0348 4.9066 4.9066 5.4038 1.6314 4.0470 5.7486 5.1079 3.7879 4.0596 2.1266 7.9060 4.3165 6.1552 1.2455 2.1333 2.2710 3.1539 1.7971 2.9696 6.2244 1.9811 2.0222 1.4301 4.4509 4.4661 2.9927 1.4359 1.6386 5.4958 1.4237 3.8082 2.3716 1.7911 1.3295 3.3778 2.7349 2.2165 1.9611 2.3442 1.6579 2.6267 1.8313 1.8854 2.8936 1.0567 1.2223 1.1280 1.2607 2.6249 2.6880 2.4327 1.3508 2.4355 2.2741 1.4571 1.4890 1.4523 1.1323 1.1740 1.3117 1.2158 1.3138 1.2531 1.3434 1.4180 1.2893 1.3063 10.0810 1.2283 1.2136 1.0478 1.0552 2.2381 1.0518 1.0481 1.0515 1.0497 1.0717 1.0693 1.0490 1.0523 2.2836 1.0775 1.0752 6.6692 6.1432 10.8899 1.0430 1.0361 1.0598 1.0361 1.0355 1.0589 1.0314 1.0835 1.0862 1.0853 1.0858 1.0997 1.1002 1.0993 1.1003 1.0996 1.0996 1.1011 1.0994 1.1008 1.1008 1.0855 1.0892 1.0941 1.1087 1.0985 1.0969 1.1074
irintensity: 0.0052 4.5617 0.1040 0.2068 0.9777 0.2357 1.5298 0.5330 0.3136 3.7548 1.1111 1.1773 1.6690 5.8787 0.0983 1.4163 0.9401 0.6150 4.1690 0.2629 0.1331 3.4888 2.4026 4.2165 6.0021 0.9980 0.2592 11.2419 11.9841 7.9947 1.6973 2.5631 0.8727 5.7046 21.9874 14.2253 24.7978 9.0169 1.9640 10.3124 10.0731 9.8740 4.0263 6.9009 21.7272 14.2188 23.0379 1.9992 15.0847 61.3959 0.6916 4.9062 17.2141 1.0984 10.4468 26.2683 92.1428 22.7870 31.5926 42.3337 27.2020 24.6118 19.3058 5.9281 28.8016 24.8986 0.6369 54.3553 4.5869 43.0304 2.2773 12.5248 58.6935 8.2203 10.7022 2.4681 5.0386 38.2398 178.1776 14.3841 49.0664 2.3747 0.2294 1.0432 28.2951 31.7244 0.3679 169.3802 221.9426 30.4277 46.0689 21.0198 20.4933 5.1085 21.8880 92.7446 12.8948 0.1754 6.5003 45.5106 21.2925 71.0957 80.6385 226.8905 2.0200 127.9131 7.7793 0.3469 0.9838 75.9215 9.8555 5.1044 1.5320 0.4608 7.5498 2.1313 8.2890 6.9689 42.8239 45.4184 2.6494 23.0695 30.5545 5.4399 8.1642 16.6896 2.8283 0.8625 0.3133 3.2236 2.4743 5.7214 21.0093 17.1332 4.6678 4.9481 8.1347 26.1091 11.0838 144.8184 5.8834 6.0182 29.2089 15.8096 11.2916 49.7727 17.5560 9.9333 31.2628 13.1996 13.3391 31.5108 6.2828 27.2324 3.3908 31.3439 30.4713 11.3872 18.6599 19.7035 17.7099 0.1806 10.0526 17.3408 27.9581 25.2161 6.2439 0.5199
temp: 298.150 k
press: 1.00000 atm
elementType: 16 8 8 8 8 8 8 8 8 8 6 6 6 6 6 6 6 6 6 6 6 6 6 6 6 6 6 6 6 6 1 1 1 1 1 1 1 1 1 1 1 1 1 1 1 1 1 1 1 1 1 1 1 1 1 1 1 1
symmnumber: 1
zpe: 1197646.4 jmol-1
zpe.correction: 0.456159 hartree
zpe.thermalcorrener: 0.488615 hartree
zpe.thermalcorrenthalpy: 0.489559 hartree
zpe.thermalcorrgfe: 0.387036 hartree
zpe.sumelectzpe: -1851.494056 hartree
zpe.sumelectthermal: -1851.461601 hartree
zpe.sumelectthermalent: -1851.460657 hartree
zpe.sumelectthermalfe: -1851.563180 hartree
dipole: -0.1783 -2.9854 -2.6583
dipole: 4.0014
quadrupole: -146.8981 -200.2499 -190.4657
quadrupole: -2.9823 6.9112 -3.3487
quadrupole: 32.3065 -21.0453 -11.2611 -2.9823 6.9112 -3.3487
hfenergy: -1851.9502159 hartree
pointgroup: C01 [X(C20H28O9S1)]
dipole: 0.1779847 -0.8514316 1.3121532 debye
polarizability: 357.4326178|10.4917323|230.9057645|-23.0450199|-12.5400562|235.0234227 unknown
InChI: InChI=1S/C20H28O9S/c1-19(2)24-11-14(27-19)16(26-18(21)13-9-7-6-8-10-13)17(29-30(5,22)23)15-12-25-20(3,4)28-15/h6-10,14-17H,11-12H2,1-5H3
charge 0 multiplicity 1
58 atoms
S  3.291136 1.680491 -1.501534
O  -1.445684 1.938765 0.54434
O  3.170571 -0.951942 0.687981
O  -1.061219 4.249043 0.610195
O  2.762232 -2.930542 1.863292
O  2.223514 1.714871 0.061445
O  -0.532337 -0.69639 0.712798
O  3.274642 3.163701 -2.145769
O  2.85896 0.415156 -2.417634
O  -1.341082 -0.660381 -1.473236
C  0.847724 1.206602 -0.113328
C  0.813509 -0.321605 0.19128
C  -0.001764 2.111978 0.819251
C  1.808849 -0.806424 1.26928
C  0.272788 3.624287 0.555948
C  1.464417 -2.234458 1.798516
C  -1.995612 3.25093 0.060793
C  3.552709 -2.404216 0.740139
C  -2.018082 3.269444 -1.476899
C  -3.359488 3.462659 0.707215
C  5.028354 -2.503893 1.112853
C  3.194411 -3.082563 -0.592752
C  -1.55566 -0.809475 -0.24663
C  4.904668 1.365838 -0.559142
C  -2.863325 -1.161942 0.369374
C  -3.944599 -1.471123 -0.496424
C  -3.051647 -1.189145 1.775122
C  -5.203007 -1.811253 0.040342
C  -4.312775 -1.528795 2.307767
C  -5.389054 -1.8420 1.443396
H  0.501874 1.363432 -1.153266
H  0.995355 -0.868888 -0.752175
H  0.166461 1.838511 1.87619
H  1.893708 -0.073541 2.090251
H  0.753696 3.782418 -0.428613
H  0.882924 4.099997 1.336502
H  1.050889 -2.230976 2.817028
H  0.765225 -2.759121 1.121755
H  -2.510454 4.189632 -1.836197
H  -2.573111 2.39324 -1.853186
H  -0.998687 3.236535 -1.898335
H  -4.067611 2.689894 0.363764
H  -3.754493 4.45587 0.433458
H  -3.263691 3.402389 1.802751
H  5.218757 -1.936056 2.037454
H  5.298795 -3.559981 1.281407
H  5.661003 -2.107694 0.299764
H  3.657093 -2.532083 -1.429572
H  3.558161 -4.124519 -0.597575
H  2.103908 -3.094108 -0.759265
H  5.072418 2.27158 0.038476
H  5.67921 1.211682 -1.323596
H  4.681401 0.479871 0.053088
H  -3.777301 -1.439795 -1.578191
H  -2.215906 -0.931102 2.430707
H  -6.035684 -2.052451 -0.629058
H  -4.46011 -1.545971 3.393025
H  -6.36738 -2.106081 1.860527
