program: Gaussian 09
title: 000256297
version: EM64L-G09RevD.01
frameworkgroup: C1[X(C27H25Cl2N3OS)]
method: RPBEPBE
basis: SDD
operation: Freq
keyword: #p
keyword: freq=noraman
keyword: PBEPBE/SDD
title: #p freq=noraman PBEPBE/SDD
converged: YES YES NO NO
title: Mulliken charges:
elementType: Cl Cl S O N N N C C C C C C C C C C C C C C C C C C C C C C C C C C C H H H H H H H H H H H H H H H H H H H H H H H H H
charge: -0.062439 -0.063680 0.248254 -0.257308 -0.128362 -0.082113 -0.046848 0.453291 -0.421156 -0.421593 -0.345984 -0.369374 -0.555116 -0.554497 0.465514 -0.415861 -0.408051 0.346988 -0.399053 0.299425 0.237965 -0.439395 0.550567 -0.344738 -0.387990 -0.396388 -0.355452 -0.713869 -0.376976 -0.362939 0.319557 -0.346670 -0.359746 -0.537424 0.238392 0.276830 0.239918 0.276113 0.223154 0.222661 0.290940 0.265056 0.292068 0.265631 0.273541 0.225635 0.216601 0.214342 0.266778 0.248987 0.237974 0.264749 0.271303 0.229391 0.253452 0.242191 0.248130 0.223935 0.223685
chargesum: 0.00000
title: Mulliken charges with hydrogens summed into heavy atoms:
elementType: Cl Cl S O N N N C C C C C C C C C C C C C C C C C C C C C C C C C C C
charge: -0.062439 -0.063680 0.248254 -0.257308 -0.128362 -0.082113 -0.046848 0.453291 0.094065 0.094438 -0.122830 -0.146712 0.000881 0.003202 0.465514 -0.142320 -0.182417 0.346988 -0.182451 0.299425 0.237965 -0.439395 0.550567 -0.130397 -0.121212 -0.147401 -0.117478 -0.449120 -0.105672 -0.133548 0.319557 -0.093218 -0.117555 0.158326
polarizability: 9.20298653e+02 8.05915458e+00 3.71625306e+02 -5.76760705e-01 1.16588914e+01 1.88528986e+02
1716.lowfreq: -6.7393 -1.0112 -0.0023 -0.0016 -0.0002 3.5357 5.8585 12.1206 17.2855
frequency: 4.4706 11.8139 17.2495 26.3872 28.5906 35.1972 37.5695 47.1730 56.4891 62.3237 82.1464 83.5752 90.5212 97.8168 106.0499 118.4119 124.7334 149.4259 161.1163 186.7411 190.5407 196.7212 224.5153 235.9079 239.2006 251.2216 263.0538 316.7911 333.3045 338.5792 348.2338 355.0306 375.5614 393.7609 410.6864 411.6614 422.5613 430.3406 441.8858 454.9263 473.7605 492.6232 501.3963 510.7734 523.6599 536.5591 559.2598 569.4991 582.2715 599.1881 605.3044 605.7814 622.4391 631.9815 638.0377 659.9334 675.7679 697.0075 729.2995 737.7633 741.5845 757.3766 770.2390 794.2118 805.0109 811.0826 818.5570 829.1757 832.9502 841.5670 850.1131 862.2221 868.6332 870.9064 875.2124 920.1458 921.5120 938.0146 942.1942 949.0406 964.9906 975.3729 981.0866 984.7275 986.4276 987.3356 995.3341 1000.4789 1001.9676 1005.8718 1028.6920 1039.0431 1046.9675 1110.8905 1112.4318 1116.4859 1130.3827 1155.9419 1162.1178 1164.0706 1175.1537 1178.7126 1180.8556 1189.9301 1197.8057 1208.3261 1228.0400 1234.7744 1239.4925 1259.8187 1264.9046 1291.5073 1295.2447 1302.7967 1306.2160 1306.7887 1319.5432 1348.1701 1355.0125 1356.0789 1366.6583 1371.1762 1387.6648 1393.4029 1425.7294 1430.7182 1435.4114 1437.2868 1439.2062 1443.5062 1459.7474 1467.1995 1469.4050 1471.3930 1480.0533 1493.4116 1519.7233 1527.2220 1535.8462 1549.9957 1558.5285 1574.1590 1582.3788 1621.9878 1624.2816 1630.6818 2940.0699 2963.5576 2979.3728 2982.6820 3053.3201 3056.6966 3057.0845 3076.5213 3082.5624 3116.6650 3127.5609 3129.1709 3130.4940 3132.7653 3144.4161 3145.7074 3147.0110 3156.2327 3161.3213 3161.5812 3165.7548 3165.9067 3167.7675 3176.4505 3243.4813
redmass: 7.9689 10.2147 7.6934 7.5375 6.7701 4.6462 4.4913 7.1990 6.0889 5.4819 5.5762 5.4325 4.3454 5.7183 4.6539 3.8607 4.4726 5.1948 5.5334 3.5289 4.0173 3.9713 3.2061 1.7620 3.9676 5.4954 6.1652 4.6724 4.4262 4.3693 4.7890 5.0046 3.2923 5.2077 2.9712 2.9714 3.0153 3.8661 3.4529 3.6382 4.2307 3.8113 3.5381 2.8152 2.7326 2.8249 2.8130 7.0006 3.5630 5.0270 4.5057 6.1677 6.5710 6.9670 6.9377 7.5675 3.8940 4.3322 2.1491 3.6817 2.8421 6.1145 2.4949 6.2178 1.3729 1.3369 5.4940 1.5222 1.2975 2.2966 1.5517 2.3256 3.4823 1.9179 4.6645 1.8723 8.0268 1.3688 1.3928 2.1402 1.3771 1.4961 1.3659 8.8004 1.3497 1.4293 2.9507 2.9899 2.5414 1.8808 2.5616 2.2725 1.8846 1.3767 1.2594 1.3203 1.5898 1.3247 1.1655 1.7470 1.3347 1.8496 1.2828 1.2828 1.5053 1.5229 2.9904 1.3346 4.0238 1.4741 1.7361 2.1914 1.2493 1.3969 1.2006 1.8084 1.5380 1.9778 1.5545 1.6660 3.1778 5.3216 1.9712 2.2158 4.0603 3.8191 1.2203 1.2858 1.1770 1.9711 3.3428 1.0500 1.1753 1.1832 2.3290 1.1775 3.3101 3.6363 5.9152 7.3677 7.1391 7.0855 5.8082 6.3044 6.3899 6.4885 1.0857 1.0328 1.0684 1.0688 1.1041 1.0582 1.0579 1.0933 1.0929 1.0891 1.0918 1.0969 1.0886 1.0878 1.0943 1.1096 1.1030 1.0880 1.0950 1.0930 1.0957 1.0938 1.0954 1.0974 1.0947
irintensity: 0.0224 0.0580 0.2408 1.2395 1.4268 0.8301 0.0124 0.5370 1.3240 0.3344 2.3416 4.8104 5.4339 1.8540 2.7365 3.4797 1.2018 0.8123 3.1618 7.5369 1.7611 2.4049 3.4530 0.1896 3.8356 8.3960 2.7564 3.1731 4.5700 4.3585 9.1006 6.5904 2.7848 3.1623 0.0187 5.1471 0.1659 6.8844 11.5621 2.1582 2.4005 12.2954 8.1898 13.7424 10.3268 38.0834 1.9077 23.8676 5.1739 21.1478 34.5200 6.6125 4.2324 0.2086 0.1704 34.5882 3.3195 33.9615 17.1218 3.8341 14.6529 1.0698 27.7198 12.4910 20.7198 23.1885 6.8884 25.4011 12.3332 47.5336 70.7437 30.6091 11.2979 0.6663 43.1187 108.8892 46.0350 10.8725 0.2907 12.3957 0.9276 20.5270 0.8625 70.8545 1.0946 12.7384 1.2922 6.1811 16.1511 3.9416 17.5776 15.8810 9.6128 19.6435 0.1915 4.7716 24.8131 9.0200 14.5760 194.3969 3.0719 40.5298 166.3258 117.2592 66.5107 3.5854 19.5310 168.9890 235.4359 5.1473 14.6141 25.8589 5.9662 9.6865 22.8415 7.4258 42.3147 24.1094 427.5872 34.1543 3.2178 2.6145 69.1600 20.1347 2.7734 48.9714 19.6779 24.7351 3.5214 38.9521 163.5684 14.1930 38.7071 141.0289 164.8621 4.0577 137.2460 206.9018 48.9567 229.2983 3.8495 32.2885 381.8254 161.0038 105.9017 328.4763 53.1355 100.6942 38.4290 38.2161 45.8790 28.2065 9.2900 1.4264 7.6957 13.8309 32.4993 6.1006 16.6618 17.7659 25.4305 29.7566 6.8319 2.7360 14.0948 28.9935 1.1096 16.4848 30.6386 6.4318 6.7039
temp: 298.150 k
press: 1.00000 atm
elementType: 17 17 16 8 7 7 7 6 6 6 6 6 6 6 6 6 6 6 6 6 6 6 6 6 6 6 6 6 6 6 6 6 6 6 1 1 1 1 1 1 1 1 1 1 1 1 1 1 1 1 1 1 1 1 1 1 1 1 1
symmnumber: 1
zpe: 1194262.3 jmol-1
zpe.correction: 0.454870 hartree
zpe.thermalcorrener: 0.486958 hartree
zpe.thermalcorrenthalpy: 0.487902 hartree
zpe.thermalcorrgfe: 0.383851 hartree
zpe.sumelectzpe: -2599.101722 hartree
zpe.sumelectthermal: -2599.069634 hartree
zpe.sumelectthermalent: -2599.068690 hartree
zpe.sumelectthermalfe: -2599.172741 hartree
dipole: 1.0850 -1.0667 -0.7148
dipole: 1.6811
quadrupole: -148.7352 -204.6018 -231.6254
quadrupole: -1.7184 -0.6306 12.2710
quadrupole: 46.2522 -9.6143 -36.6379 -1.7184 -0.6306 12.2710
hfenergy: -2599.5565922 hartree
pointgroup: C01 [X(C27H25Cl2N3O1S1)]
dipole: 0.4375275 0.2451812 0.4311522 debye
polarizability: 919.0492257|-27.6690123|330.7339748|-3.2172506|78.1145292|230.6697447 unknown
InChI: InChI=1S/C27H25Cl2N3OS/c1-33-25-12-6-22(7-13-25)27-31-26(19-34-27)21-4-8-23(9-5-21)30-18-20-2-10-24(11-3-20)32(16-14-28)17-15-29/h2-13,18-19H,14-17H2,1H3
charge 0 multiplicity 1
59 atoms
Cl -10.433244 -0.644606 2.290386
Cl -9.762386 2.711199 -1.928939
S  6.266188 -2.663387 -1.0794
O  10.04466 2.625966 1.281939
N  -8.191059 0.695641 0.218119
N  -1.898804 -0.994128 -0.591589
N  4.649954 -0.693719 -0.28316
C  -6.808423 0.452751 0.244177
C  -8.847335 1.470571 1.282254
C  -9.034649 0.187307 -0.874979
C  -6.163434 -0.308035 -0.790249
C  -5.979887 0.952042 1.30134
C  -9.112186 0.683516 2.574034
C  -8.965348 1.008733 -2.170529
C  -3.964692 -0.048043 0.28792
C  -4.785151 -0.549784 -0.7626
C  -4.59794 0.706119 1.312931
C  2.345458 -1.543353 -0.699371
C  -2.521879 -0.287214 0.326194
C  3.810125 -1.726813 -0.743826
C  -0.490429 -1.134954 -0.588212
C  5.940655 -0.972447 -0.368287
C  7.036418 -0.090464 0.037107
C  1.442695 -2.555344 -1.133008
C  1.802291 -0.316035 -0.22915
C  0.054811 -2.350827 -1.091559
C  0.412733 -0.111337 -0.17198
C  4.493901 -2.851005 -1.205417
C  6.729112 1.191058 0.586961
C  8.400197 -0.457974 -0.093781
C  9.108869 1.679535 0.850066
C  7.748537 2.063673 0.987717
C  9.435322 0.411116 0.305669
C  11.465609 2.284552 1.162865
H  -8.232434 2.356643 1.541035
H  -9.797748 1.8690 0.891049
H  -8.753616 -0.857546 -1.117138
H  -10.07788 0.143131 -0.521641
H  -6.742775 -0.716613 -1.622993
H  -6.409032 1.537043 2.119293
H  -8.22877 0.135523 2.930834
H  -9.520634 1.331956 3.36484
H  -7.935115 1.218977 -2.490525
H  -9.540959 0.533757 -2.980296
H  -4.304103 -1.131892 -1.555616
H  -3.993299 1.105602 2.137439
H  -1.984476 0.146593 1.197478
H  1.825517 -3.509325 -1.512548
H  2.496938 0.47037 0.080931
H  -0.64036 -3.123384 -1.435211
H  0.020739 0.856633 0.161684
H  4.088765 -3.77454 -1.611602
H  5.6779 1.47622 0.688336
H  8.665582 -1.43586 -0.513392
H  7.523825 3.04751 1.410207
H  10.475984 0.095011 0.190057
H  12.003747 3.15842 1.557593
H  11.750527 2.116054 0.106391
H  11.715086 1.389005 1.764154
