program: Gaussian 09
title: 000264499
version: EM64L-G09RevD.01
frameworkgroup: C1[X(C28H26N2O)]
method: RPBEPBE
basis: SDD
operation: Freq
keyword: #p
keyword: freq=noraman
keyword: PBEPBE/SDD
title: #p freq=noraman PBEPBE/SDD
converged: NO YES NO NO
title: Mulliken charges:
elementType: O N N C C C C C C C C C C C C C C C C C C C C C C C C C C C C H H H H H H H H H H H H H H H H H H H H H H H H H H
charge: -0.241817 -0.191058 -0.328651 -0.357365 -0.366736 -0.307425 -0.320365 0.469788 -0.702751 0.348131 0.318794 -0.392025 -0.401230 0.216329 0.357918 0.160957 -0.120259 -0.437584 -0.365540 0.416035 -0.402118 -0.425430 -0.381249 -0.358906 -0.462844 -0.261476 -0.249328 -0.431120 -0.254208 -0.275200 -0.243409 0.225746 0.212855 0.222602 0.220570 0.196078 0.220700 0.223262 0.195324 0.225131 0.291174 0.231786 0.218896 0.237721 0.248113 0.239884 0.243279 0.260493 0.250521 0.234761 0.221255 0.227889 0.234392 0.227575 0.224889 0.225407 0.229838
chargesum: 0.00000
title: Mulliken charges with hydrogens summed into heavy atoms:
elementType: O N N C C C C C C C C C C C C C C C C C C C C C C C C C C C C
charge: -0.241817 -0.191058 -0.098813 0.081236 0.076436 0.109352 0.098221 0.469788 -0.186446 0.348131 0.318794 -0.160239 -0.182334 0.216329 0.357918 0.160957 -0.120259 -0.199863 -0.117427 0.416035 -0.162233 -0.182151 -0.120756 -0.108385 -0.228083 -0.040221 -0.021439 -0.196728 -0.026633 -0.050311 -0.018002
polarizability: 4.03740779e+02 -2.82216887e+00 3.26670481e+02 -4.15151678e+01 -2.73598800e+01 2.80458154e+02
1716.lowfreq: -9.0389 -6.0394 -1.8953 0.0005 0.0006 0.0008 3.8191 13.8877 18.7607
frequency: -4.0797 13.6777 18.5901 25.1662 39.8581 49.5245 59.4287 77.1578 100.2024 104.0932 133.7177 148.6786 164.0789 175.6511 193.6313 219.1885 229.2639 237.6372 261.6765 269.9463 298.4700 342.6702 368.5665 381.0413 392.5576 407.0724 410.1527 414.9590 425.3965 444.5570 457.6633 467.0358 470.3712 500.9734 505.2566 518.0683 529.7910 533.6072 562.0390 588.1253 615.8364 624.0647 631.5735 633.1106 665.8410 678.5767 705.3984 725.3890 740.6673 741.0675 770.4928 780.2199 782.8963 785.3116 800.1397 805.2089 812.0050 816.7179 827.5186 839.1304 855.8786 865.5875 874.0439 884.6276 895.1017 911.3444 913.3189 916.8885 947.4711 949.3853 959.4647 962.7516 967.0075 981.8470 990.6753 992.0307 997.1514 1009.7574 1018.6453 1033.0526 1043.6386 1048.6335 1053.5889 1078.7700 1081.9043 1093.3172 1102.9820 1131.4473 1148.4361 1157.8270 1172.7260 1173.1606 1174.6592 1177.9949 1180.7800 1198.4220 1199.2741 1210.9353 1216.9867 1233.8120 1234.4554 1243.1137 1259.2257 1270.2460 1283.4826 1295.2644 1306.3858 1312.2531 1331.3088 1333.4392 1344.5719 1359.2857 1364.6252 1369.5457 1373.2091 1379.3858 1380.3600 1405.1003 1420.8101 1430.0309 1432.7784 1438.8699 1446.9263 1448.7730 1451.3788 1454.4288 1461.2676 1463.9429 1483.8649 1513.5282 1516.7773 1539.3219 1565.3854 1580.2955 1589.9872 1599.1409 1607.4347 1623.1335 1632.0010 2920.5842 2928.8470 2954.1479 2958.6857 2969.7437 3038.0742 3058.3879 3083.9731 3086.9000 3090.8174 3116.2850 3116.9248 3117.9148 3118.3308 3129.9147 3130.8035 3133.2618 3136.7412 3143.2399 3149.0696 3152.2712 3158.1313 3161.5803 3163.3144 3164.1096 3298.5321
redmass: 5.9698 5.2984 4.7257 3.5728 5.0475 4.6897 3.7822 4.1710 4.4826 4.6675 5.7451 4.1114 5.0955 4.1190 4.4394 2.4387 3.3808 3.4112 3.6750 4.2025 3.9184 4.0288 4.3571 2.1338 2.8003 3.3505 3.8304 3.0333 4.2259 3.7549 2.8186 4.8192 3.2615 4.0806 6.2048 3.8929 3.0493 3.1430 3.9498 5.0673 2.9125 4.3173 6.0349 3.7603 3.4798 4.4334 3.9737 3.3971 2.3961 1.4788 2.5378 2.2925 2.2478 5.0240 2.1826 1.5468 1.8008 1.9399 2.4978 1.7021 3.2580 1.6023 1.3094 3.6227 1.5294 2.0202 2.3582 2.5959 1.5880 1.4383 1.3912 1.3902 1.5247 1.3601 1.3463 1.3299 2.7908 4.6036 2.3537 2.3114 2.3535 2.3143 1.9588 2.2024 4.6293 2.3002 2.1570 1.5494 1.4464 2.1830 1.2505 2.3009 1.1089 1.3239 1.4892 1.1909 1.1128 1.2074 1.9856 1.8564 1.4025 2.0553 1.3001 1.7461 1.1965 1.5363 1.5728 1.3461 2.1656 1.3869 1.3456 1.6173 2.1842 1.9332 3.9363 2.3276 1.6308 2.8586 4.7110 2.2264 3.9542 2.2744 1.0833 1.7964 1.0883 1.1014 1.1155 1.4247 2.6153 2.8032 3.6598 6.9683 6.6791 6.7970 7.3687 5.1354 6.2137 6.2577 6.4729 1.0691 1.0713 1.0668 1.0667 1.0639 1.0948 1.0918 1.0960 1.0983 1.0893 1.0863 1.0888 1.0855 1.0863 1.0881 1.0890 1.0914 1.0868 1.0938 1.0946 1.0987 1.0944 1.1006 1.0940 1.0992 1.0745
irintensity: 0.0181 0.0124 0.0306 0.6060 0.7964 0.7551 1.7595 2.5264 0.3005 1.0851 2.0000 0.8387 0.1579 2.6486 1.1370 1.2104 5.0058 12.3554 6.3048 11.5690 4.6660 4.6713 4.0600 1.9381 9.6225 6.7245 1.4761 0.6205 3.8291 6.3173 1.4332 0.0612 0.0317 13.0750 1.2348 3.7618 8.6722 5.2459 2.5695 6.9098 54.5866 3.5678 1.1743 0.6024 6.5926 5.7064 9.7217 5.5828 15.8945 0.9987 22.6539 24.5550 31.2158 2.3510 9.5792 93.0848 43.8059 44.7863 11.0695 7.9711 5.4769 0.5279 47.1904 30.8166 11.2409 22.6532 45.1512 18.2790 6.0653 1.2896 5.9506 3.1484 0.9202 3.1577 0.4853 0.2527 0.9592 3.2389 19.8712 8.5845 11.9089 7.0436 16.2419 7.0244 45.8935 22.2936 15.4117 0.9089 1.7375 33.3518 3.3158 3.7178 4.0178 18.8020 45.1110 4.7637 3.8848 27.0911 10.7404 2.5771 270.1730 0.0631 43.2526 5.1421 21.1318 14.5237 5.3782 7.0852 110.1598 34.3388 17.5982 0.2120 6.5634 53.2366 27.9161 18.4455 110.0273 3.7285 3.6567 1.5736 0.3479 18.5394 3.3716 19.0080 8.7134 28.2575 34.9849 24.5446 38.9174 90.8072 4.9105 37.8399 35.5188 24.8139 6.3772 8.6377 10.3675 303.7365 0.7074 63.5352 82.3913 28.9275 103.6998 39.3983 9.2295 21.5380 33.7094 48.1477 14.5361 1.4866 8.2395 1.1054 8.6084 4.5484 7.5843 23.0954 20.0566 30.2442 41.6049 28.9652 22.4724 35.2981 10.7589 22.1370 36.7548
temp: 298.150 k
press: 1.00000 atm
elementType: 8 7 7 6 6 6 6 6 6 6 6 6 6 6 6 6 6 6 6 6 6 6 6 6 6 6 6 6 6 6 6 1 1 1 1 1 1 1 1 1 1 1 1 1 1 1 1 1 1 1 1 1 1 1 1 1 1
symmnumber: 1
zpe: 1221099.9 jmol-1
zpe.correction: 0.465092 hartree
zpe.thermalcorrener: 0.490019 hartree
zpe.thermalcorrenthalpy: 0.490964 hartree
zpe.thermalcorrgfe: 0.408074 hartree
zpe.sumelectzpe: -1265.116958 hartree
zpe.sumelectthermal: -1265.092031 hartree
zpe.sumelectthermalent: -1265.091087 hartree
zpe.sumelectthermalfe: -1265.173977 hartree
dipole: 3.3447 -0.4609 -1.1352
dipole: 3.5620
quadrupole: -183.4512 -172.7787 -170.7396
quadrupole: 2.2765 2.6365 -8.1876
quadrupole: -7.7947 2.8778 4.9169 2.2765 2.6365 -8.1876
hfenergy: -1265.5820501 hartree
pointgroup: C01 [X(C28H26N2O1)]
dipole: -1.1852582 -0.4785531 -0.5745514 debye
polarizability: 379.7049837|34.2324869|311.4265936|22.6664937|57.3198106|319.7378362 unknown
InChI: InChI=1S/C28H26N2O/c29-28(22-12-14-25(15-13-22)30-16-18-31-19-17-30)27-11-4-2-7-24(27)20-23-9-5-8-21-6-1-3-10-26(21)23/h1-15,29H,16-20H2
charge 0 multiplicity 1
57 atoms
O  -6.967416 -3.121319 -1.30717
N  -4.23982 -2.430351 -0.594351
N  1.542488 -0.757857 2.106488
C  -4.612805 -2.760211 -1.991885
C  -5.151377 -3.032849 0.401659
C  -6.089175 -2.423431 -2.258892
C  -6.617331 -2.705765 0.058181
C  -2.898482 -2.152301 -0.254338
C  3.349662 1.098402 0.61373
C  3.31326 -0.133594 -0.279299
C  2.405441 2.234231 0.203777
C  -2.361607 -2.494474 1.027072
C  -2.02407 -1.485997 -1.169688
C  2.296285 -1.13592 -0.170807
C  -0.17622 -1.492062 0.465381
C  2.188564 3.341461 1.113332
C  1.21049 -1.098498 0.874626
C  -1.040879 -2.160691 1.372279
C  -0.700781 -1.177942 -0.818803
C  1.315301 4.431202 0.716647
C  1.765091 2.250057 -1.041913
C  4.309806 -0.290528 -1.274708
C  2.318849 -2.244766 -1.059935
C  2.809961 3.410127 2.406377
C  0.682164 4.397168 -0.56978
C  0.905773 3.32486 -1.431513
C  4.331406 -1.403085 -2.145184
C  1.101702 5.526299 1.618421
C  3.326962 -2.38948 -2.036023
C  2.584294 4.490425 3.263638
C  1.721881 5.560411 2.868729
H  -4.450509 -3.845682 -2.179511
H  -3.983007 -2.199968 -2.699864
H  -4.936992 -2.612347 1.399327
H  -5.016852 -4.137543 0.452335
H  -6.247706 -1.325891 -2.180967
H  -6.395704 -2.77345 -3.258103
H  -7.302115 -3.257317 0.72296
H  -6.788865 -1.613128 0.170916
H  4.384957 1.495742 0.631211
H  3.104269 0.777537 1.641123
H  -2.961083 -3.058679 1.746698
H  -2.385593 -1.174855 -2.154323
H  -0.659411 -2.467665 2.354375
H  -0.067872 -0.653212 -1.542383
H  1.931579 1.423265 -1.740719
H  5.084501 0.480794 -1.363643
H  1.541664 -3.011364 -0.968701
H  3.469944 2.59959 2.729481
H  0.025139 5.225208 -0.861936
H  0.426258 3.298369 -2.416681
H  5.122718 -1.496514 -2.897453
H  0.437957 6.341779 1.305627
H  3.329297 -3.262109 -2.698419
H  3.067765 4.519556 4.246574
H  1.551052 6.401955 3.54933
H  0.717095 -0.738595 2.743602
