program: Gaussian 09
title: 000264438
version: EM64L-G09RevD.01
frameworkgroup: C1[X(C26H22O)]
method: RPBEPBE
basis: SDD
operation: Freq
keyword: #pfreq=noraman
keyword: PBEPBE/SDD
title: #p freq=noraman PBEPBE/SDD
converged: YES YES NO NO
title: Mulliken charges:
elementType: O C C C C C C C C C C C C C C C C C C C C C C C C C C H H H H H H H H H H H H H H H H H H H H H H
charge: -0.240016 -0.775894 0.401232 0.531633 0.156324 0.367671 -0.630311 0.378760 -0.409921 -0.015074 0.346673 -0.427478 -0.427386 -0.366438 0.331105 -0.541469 0.321517 -0.420822 -0.404887 -0.238565 -0.413346 -0.257342 -0.414338 -0.247733 -0.245303 -0.818464 -0.808110 0.272972 0.220625 0.265303 0.233161 0.236495 0.232166 0.263455 0.267679 0.272816 0.242168 0.229592 0.232436 0.235802 0.233499 0.225477 0.224854 0.223377 0.235327 0.230313 0.231823 0.227832 0.230809
chargesum: 0.00000
title: Mulliken charges with hydrogens summed into heavy atoms:
elementType: O C C C C C C C C C C C C C C C C C C C C C C C C C C
charge: -0.240016 -0.282296 0.401232 0.531633 0.156324 0.367671 -0.365007 0.378760 -0.176760 -0.015074 0.346673 -0.190984 -0.195220 -0.102982 0.331105 -0.273791 0.321517 -0.178655 -0.132071 -0.008972 -0.177544 -0.024906 -0.180839 -0.022256 -0.020449 -0.129447 -0.117647
polarizability: 2.81233606e+02 -6.15760544e+01 3.25417077e+02 -1.09705837e+01 1.83097221e+01 2.46314058e+02
1716.lowfreq: -6.4707 -2.6875 -0.0004 0.0004 0.0005 8.7508 12.6119 17.6174 33.1949
frequency: 12.4188 16.9884 33.1402 45.8495 52.6449 65.7546 96.0500 98.2858 117.1226 144.5374 155.5062 166.1200 181.5151 186.4983 219.8844 229.5295 275.6370 282.5870 294.0303 302.2735 351.4464 367.0086 393.6333 396.3712 413.4044 431.7630 441.7141 450.9942 482.3819 502.0619 505.6264 514.1829 526.7917 534.3226 577.2008 597.6247 620.9548 625.2105 654.5252 675.6172 700.2233 712.6373 738.4968 740.7548 754.5497 758.6658 769.8773 783.5419 789.2221 809.5307 835.3836 851.5706 862.5823 873.5585 882.3346 894.7511 916.5922 924.2884 940.2339 950.4216 955.0516 962.6051 964.9600 976.7316 981.6315 990.2368 993.5641 994.0957 1003.8044 1023.0214 1031.2793 1045.5068 1053.5199 1094.7476 1123.8159 1124.7965 1152.9597 1156.5883 1169.7003 1174.3024 1178.0856 1186.1873 1189.6432 1205.8959 1235.0108 1238.5215 1261.9356 1273.5542 1276.7343 1286.8089 1301.0017 1311.6706 1362.0051 1372.5527 1374.3736 1392.4045 1397.1519 1406.7387 1410.2742 1425.5448 1428.8793 1434.8035 1459.9175 1464.9512 1466.5120 1468.5963 1474.6521 1475.2410 1477.2826 1496.0748 1515.3015 1536.0632 1576.0079 1581.8547 1584.0943 1601.1343 1606.4977 1616.5767 1641.4015 2969.8495 2971.6715 2995.2753 3041.1635 3045.5103 3075.9846 3085.8871 3088.3352 3112.9724 3117.0935 3118.4201 3124.1060 3125.1780 3130.2428 3131.3655 3138.2252 3138.4273 3140.3915 3143.9866 3159.5245 3159.6937 3162.7842
redmass: 5.2429 4.5147 3.5098 5.4785 4.3178 4.5341 1.6866 1.7694 5.8490 3.8728 1.1021 5.7731 3.7529 3.5673 5.0610 3.8158 3.9265 3.8576 2.8725 4.2648 6.6590 3.8809 3.4010 3.4322 2.3840 3.4059 2.8842 4.4596 2.5307 4.5438 3.6960 6.1674 4.2483 4.2732 4.1922 4.5451 6.1746 6.0784 3.6403 4.4761 4.2788 3.1674 3.1820 3.2837 1.2861 4.5572 2.6707 2.2046 2.5995 2.4986 1.5081 1.6587 3.1731 1.6238 3.3548 1.6437 1.3975 1.7104 2.0511 3.0910 2.0907 1.6546 1.4552 1.4033 1.3771 1.3456 1.5848 1.3576 1.6294 2.2637 1.4672 2.3794 1.6582 2.3114 1.8393 1.7419 1.6877 1.4259 1.1488 1.0940 1.2581 1.3124 2.1487 2.2760 2.2648 2.2348 1.7209 2.0329 1.7884 1.4055 2.1038 1.5497 1.7025 5.4631 5.6782 1.2847 2.5174 1.3890 5.2048 3.7040 2.3542 2.7244 1.0495 2.1334 1.1699 1.4015 1.0629 1.9397 1.2154 2.4003 3.4635 7.7163 6.4668 7.1852 7.2193 6.0526 5.6890 6.2246 6.7749 1.0376 1.0384 1.0653 1.0967 1.0967 1.0956 1.0985 1.0978 1.0863 1.0856 1.0870 1.0885 1.0890 1.0921 1.0879 1.0911 1.0970 1.0951 1.0936 1.1001 1.0956 1.1007
irintensity: 0.2653 0.3391 0.2332 1.6582 0.1177 0.8984 0.1268 0.3996 1.7253 0.8572 2.1039 1.7014 1.1318 0.2579 1.7833 2.9999 1.1488 3.4450 1.1061 2.6051 4.2660 1.7021 0.3070 0.5506 1.1392 5.2742 3.8611 1.8966 24.7360 2.9554 3.7498 0.1270 1.6864 2.1037 0.9616 3.2189 6.7658 7.9167 3.9941 13.4751 3.4461 16.2513 20.1497 16.1172 51.5097 1.9679 15.4865 14.7716 2.2081 48.5620 33.8281 10.3892 25.3096 21.3224 2.0890 0.2005 6.1345 6.8073 16.8906 26.3971 6.4676 3.0500 0.7645 8.6749 4.2453 0.1874 0.3102 0.3376 4.8395 5.1351 13.4595 5.1130 0.0460 9.4892 19.8539 13.4600 5.7084 7.3911 0.7885 1.6864 1.2728 2.2126 0.7430 2.5604 5.4552 24.9503 1.5543 146.6494 6.2087 1.5941 130.2334 25.9152 5.1049 3.8949 4.4569 4.3225 7.9526 12.5235 2.4721 2.0712 2.3021 2.0257 1.3555 10.5006 22.2474 50.1942 24.1913 9.8470 5.1877 1.1064 14.6040 148.6114 12.5088 0.2597 11.8566 25.6378 7.5800 34.8955 6.7781 52.9536 9.3414 36.3452 35.4407 0.6508 0.8080 31.6666 5.4131 5.8100 3.8100 8.4833 0.8200 20.3471 5.8960 3.0878 7.7292 16.3923 39.6992 24.6971 33.4438 13.3606 30.0905
temp: 298.150 k
press: 1.00000 atm
elementType: 8 6 6 6 6 6 6 6 6 6 6 6 6 6 6 6 6 6 6 6 6 6 6 6 6 6 6 1 1 1 1 1 1 1 1 1 1 1 1 1 1 1 1 1 1 1 1 1 1
symmnumber: 1
zpe: 1038773.5 jmol-1
zpe.correction: 0.395648 hartree
zpe.thermalcorrener: 0.418757 hartree
zpe.thermalcorrenthalpy: 0.419701 hartree
zpe.thermalcorrgfe: 0.340936 hartree
zpe.sumelectzpe: -1077.365707 hartree
zpe.sumelectthermal: -1077.342598 hartree
zpe.sumelectthermalent: -1077.341654 hartree
zpe.sumelectthermalfe: -1077.420418 hartree
dipole: 0.9480 2.0309 -3.4806
dipole: 4.1398
quadrupole: -152.6779 -136.3867 -154.3210
quadrupole: -3.8503 -5.3312 5.5547
quadrupole: -4.8827 11.4085 -6.5258 -3.8503 -5.3312 5.5547
hfenergy: -1077.7613544 hartree
pointgroup: C01 [X(C26H22O1)]
dipole: 0.1889206 0.5837921 1.5087114 debye
polarizability: 344.0622791|51.8683458|264.3330915|-15.6580497|-10.4316549|244.5693704 unknown
InChI: InChI=1S/C26H22O/c1-18-11-13-24(15-19(18)2)26(27)25-10-6-5-9-23(25)17-20-12-14-21-7-3-4-8-22(21)16-20/h3-16H,17H2,1-2H3
charge 0 multiplicity 1
49 atoms
O  -1.3862 0.593979 -2.311867
C  -1.624467 -2.257537 -1.379433
C  -2.546603 -1.481128 -0.437393
C  -0.185446 -2.352478 -0.867711
C  -2.412766 -0.071497 -0.22906
C  2.229222 -1.873554 -1.099614
C  0.877961 -1.777668 -1.572006
C  2.498778 -2.589286 0.130798
C  0.092802 -3.052171 0.357687
C  -1.46663 0.769669 -1.053387
C  -0.65401 1.839587 -0.389217
C  -3.538241 -2.176918 0.29499
C  1.395521 -3.171483 0.839824
C  -3.268951 0.586156 0.693846
C  0.487722 2.792171 1.589457
C  -0.33629 1.809315 0.994937
C  1.002149 3.85118 0.778178
C  3.325966 -1.282124 -1.810366
C  -0.124782 2.885054 -1.189605
C  -4.395803 -1.514011 1.202836
C  3.850497 -2.690855 0.598193
C  -4.261588 -0.123144 1.403668
C  0.682456 3.876615 -0.604982
C  4.633565 -1.395259 -1.331122
C  4.899173 -2.106802 -0.117141
C  0.826591 2.713018 3.0670
C  1.885492 4.928882 1.376645
H  -1.627325 -1.779837 -2.372887
H  -2.034455 -3.279119 -1.496737
H  0.678423 -1.227467 -2.499558
H  -0.740283 -3.496637 0.91589
H  -3.643482 -3.258181 0.143351
H  1.592818 -3.715914 1.771603
H  -3.16987 1.667992 0.835045
H  -0.711924 0.985966 1.612514
H  -0.356442 2.893891 -2.259642
H  3.120976 -0.735115 -2.738435
H  -5.161348 -2.079587 1.745869
H  -4.922094 0.404671 2.100013
H  4.050237 -3.236248 1.528785
H  1.080404 4.688142 -1.225733
H  5.463414 -0.939449 -1.882676
H  5.929397 -2.190246 0.246743
H  0.507426 3.623983 3.609123
H  0.336734 1.847087 3.543061
H  1.917301 2.612856 3.228018
H  2.197572 5.660447 0.612697
H  1.365045 5.480586 2.183434
H  2.799759 4.498168 1.828763
