program: Gaussian 09
title: 000023157
version: EM64L-G09RevD.01
frameworkgroup: C1[X(C18H20N4O2)]
method: RPBEPBE
basis: SDD
operation: Freq
keyword: #p
keyword: freq=noraman
keyword: PBEPBE/SDD
title: #p freq=noraman PBEPBE/SDD
converged: YES YES NO NO
title: Mulliken charges:
elementType: O O N N N N C C C C C C C C C C C C C C C C C C H H H H H H H H H H H H H H H H H H H H
charge: -0.214565 -0.167708 -0.411324 -0.102897 -0.012397 0.011970 0.308945 -0.479474 -0.364139 0.290540 -0.328897 0.223326 -0.216667 -0.085335 -0.370293 0.332614 -0.306403 -0.316436 -0.274700 -0.378683 -0.616665 -0.608102 -0.290651 -0.229174 0.220976 0.201402 0.212320 0.282538 0.197316 0.213054 0.291054 0.193431 0.251875 0.273724 0.236951 0.273561 0.192709 0.221510 0.230074 0.191089 0.225934 0.235302 0.228694 0.233602
chargesum: 0.00000
title: Mulliken charges with hydrogens summed into heavy atoms:
elementType: O O N N N N C C C C C C C C C C C C C C C C C C
charge: -0.214565 -0.167708 -0.120270 -0.102897 -0.012397 0.011970 0.308945 -0.057096 0.130719 0.290540 0.081473 0.223326 -0.216667 -0.085335 -0.176862 0.332614 -0.054528 -0.042712 -0.037750 -0.105122 0.027628 0.044222 -0.061958 0.004428
polarizability: 2.99227577e+02 3.60564494e+01 3.09360983e+02 -4.56454912e+01 2.55887952e+01 1.63307802e+02
1716.lowfreq: -9.0585 0.0002 0.0005 0.0006 2.6157 7.3984 12.6410 20.1398 36.3411
frequency: 12.4546 19.9755 36.3194 41.7940 52.0705 66.9035 79.2221 104.9896 135.8203 153.1571 163.2196 196.0409 213.6582 225.1411 236.6538 238.7280 269.9779 299.9868 314.4994 326.7204 335.6172 357.1745 376.7253 388.6187 409.7346 419.1803 451.6353 461.3760 500.2664 509.4440 519.3974 555.4461 574.4223 579.0211 605.0749 636.2142 648.5100 665.3152 695.6911 705.2111 737.2949 739.9301 770.8167 772.0358 795.4018 814.1811 828.2465 841.7966 875.8030 881.2397 886.8059 910.9188 949.2351 962.3812 964.0683 966.9067 995.6059 1001.8383 1025.7573 1035.6088 1055.9746 1075.1022 1081.9842 1085.3133 1094.0865 1115.9912 1134.6215 1153.5367 1160.3064 1172.9290 1191.1085 1203.8724 1212.2100 1224.0605 1252.2544 1263.6488 1267.6197 1270.2633 1293.8521 1298.3072 1338.1368 1347.0380 1349.5544 1366.1233 1370.0361 1376.0379 1399.6670 1420.2572 1429.0467 1436.2400 1442.1577 1451.5849 1457.3492 1463.2224 1464.7238 1471.3897 1475.7418 1476.3632 1481.5379 1486.1029 1509.0462 1523.9536 1550.9692 1556.3765 1607.5083 1626.4008 2851.6525 2858.0430 2874.5255 2963.7672 2975.9850 3014.5796 3025.0265 3027.8327 3041.1310 3071.4063 3080.7334 3084.5636 3111.9572 3133.4947 3150.2347 3157.6049 3171.0768 3177.9270 3180.0653 3531.5887
redmass: 5.0884 4.2643 4.8993 2.9085 12.5775 3.2899 4.5680 4.8662 8.1156 4.6060 2.5888 2.1985 1.9316 1.7375 1.3065 4.3274 4.8847 5.2156 2.6390 3.8861 6.0383 2.5345 4.4868 2.3352 2.3954 3.2519 3.6273 5.8102 2.9491 3.3626 1.9140 2.9535 3.6046 4.1098 5.5290 5.8562 5.9585 5.7968 6.1290 7.0577 2.2653 2.2584 1.6248 1.9882 6.6563 3.8760 4.6048 2.2150 1.6850 2.7278 4.9499 1.4216 2.1484 1.9735 1.3578 2.3239 1.3411 2.0306 2.1310 1.5365 2.5386 1.8682 1.9429 1.7913 1.6349 2.1932 1.4697 2.5471 1.3413 1.7057 1.4567 1.4317 1.3955 6.8043 2.5737 1.6571 2.4939 1.8299 1.7964 1.7868 1.6671 1.9103 1.5096 3.1221 1.4502 8.2671 3.2405 1.1483 2.6452 2.4179 1.1561 2.7596 1.2244 1.0774 1.6428 1.2877 1.0861 1.0591 1.0958 1.0545 3.8031 6.0889 5.1386 3.9908 5.8849 6.5329 1.0691 1.0564 1.0577 1.0650 1.0668 1.0882 1.0740 1.0732 1.0951 1.0969 1.1010 1.1008 1.0876 1.0861 1.0905 1.0912 1.0958 1.0972 1.0967 1.0744
irintensity: 0.9992 0.1480 1.0878 0.6920 1.7759 0.3212 1.2153 2.0445 1.1844 1.1215 1.2781 2.2255 0.2618 3.9374 0.7980 0.8593 2.7304 0.0627 7.8393 6.2717 1.6257 1.8563 1.0326 5.0955 2.3121 0.8770 6.7999 1.3533 2.4153 1.3742 43.4352 19.9064 7.7801 24.9935 4.4341 27.6767 8.0301 17.2122 14.5971 18.7979 9.9374 75.9778 85.2865 4.2948 14.8092 7.3607 3.1818 4.2228 3.1494 0.4732 3.7738 3.5748 3.7380 1.0448 2.3995 2.1365 0.0823 27.3073 8.3928 12.4289 2.6917 12.6754 7.1289 15.0114 4.7953 10.7689 6.5641 2.0512 16.1378 3.6850 9.7173 3.5693 65.2595 343.8668 1.5809 4.2818 6.7790 6.5569 8.3436 2.2887 2.0696 38.0553 23.1845 60.1406 14.3001 134.3078 26.6667 5.3867 24.2225 33.0790 10.4821 3.5583 23.8589 12.1993 4.9695 25.6739 20.1080 10.5030 35.4686 14.4422 204.6853 125.8245 157.9481 20.0544 38.9225 15.2158 52.8567 82.9160 248.6668 35.0299 77.1718 8.9861 22.9820 32.9902 76.4346 11.8139 19.3941 44.3093 13.7188 6.0782 14.4993 13.5734 12.5881 5.4721 24.3145 21.9341
temp: 298.150 k
press: 1.00000 atm
elementType: 8 8 7 7 7 7 6 6 6 6 6 6 6 6 6 6 6 6 6 6 6 6 6 6 1 1 1 1 1 1 1 1 1 1 1 1 1 1 1 1 1 1 1 1
symmnumber: 1
zpe: 922943.4 jmol-1
zpe.correction: 0.351531 hartree
zpe.thermalcorrener: 0.373459 hartree
zpe.thermalcorrenthalpy: 0.374403 hartree
zpe.thermalcorrgfe: 0.298067 hartree
zpe.sumelectzpe: -1065.530436 hartree
zpe.sumelectthermal: -1065.508508 hartree
zpe.sumelectthermalent: -1065.507564 hartree
zpe.sumelectthermalfe: -1065.583900 hartree
dipole: 9.9798 -2.4258 -3.1005
dipole: 10.7282
quadrupole: -159.4865 -124.2992 -139.7663
quadrupole: 2.2560 5.3798 7.7204
quadrupole: -18.3025 16.8848 1.4177 2.2560 5.3798 7.7204
hfenergy: -1065.881967 hartree
pointgroup: C01 [X(C18H20N4O2)]
dipole: -3.8926189 -0.9416639 1.3326913 debye
polarizability: 297.9854262|-38.3523149|306.7369405|-46.7764043|-30.3286553|167.1739948 unknown
InChI: InChI=1S/C18H20N4O2/c1-21(2)12-6-11-19-17-13-7-3-4-9-15(13)20-18-14(17)8-5-10-16(18)22(23)24/h3-5,7-10,19H,6,11-12H2,1-2H3
charge 0 multiplicity 1
44 atoms
O  4.643121 -1.55634 -1.550609
O  4.617556 0.391925 -0.359525
N  -1.667524 -0.229878 1.683156
N  -3.82639 -1.150617 -1.22295
N  1.808281 0.974039 -0.529701
N  4.104366 -0.733987 -0.703763
C  -0.537535 0.202417 1.002538
C  -3.946909 -1.146054 1.290359
C  -3.080428 0.126809 1.418263
C  0.570486 -0.715548 0.818152
C  -3.627165 -1.950303 0.007201
C  -0.410952 1.53625 0.473368
C  1.736982 -0.240018 0.077873
C  0.761831 1.841057 -0.337778
C  0.547596 -2.071504 1.281966
C  2.84183 -1.166201 -0.062574
C  -1.34379 2.598697 0.73981
C  0.872763 3.139231 -0.945779
C  1.622308 -2.938315 1.073036
C  2.786836 -2.480917 0.390735
C  -5.248858 -0.947515 -1.565015
C  -3.048792 -1.659697 -2.372984
C  -1.184773 3.859368 0.16762
C  -0.081346 4.124562 -0.709341
H  -5.010905 -0.841787 1.298907
H  -3.810514 -1.801775 2.176283
H  -3.481515 0.775147 2.223427
H  -3.137988 0.667411 0.458762
H  -4.237699 -2.889693 0.002168
H  -2.56496 -2.260722 0.034153
H  -1.556171 -1.080458 2.237886
H  -0.330875 -2.470143 1.804024
H  -2.170483 2.434432 1.434682
H  1.754852 3.317318 -1.56787
H  1.576196 -3.971566 1.429853
H  3.639766 -3.143871 0.219582
H  -5.78051 -1.902512 -1.808376
H  -5.784893 -0.463022 -0.730382
H  -5.325043 -0.280554 -2.441858
H  -3.369054 -2.676878 -2.712076
H  -3.157572 -0.967977 -3.227233
H  -1.977455 -1.705168 -2.109275
H  -1.89835 4.657416 0.39918
H  0.023578 5.114644 -1.166298
